Bündelpfeiler
type: NamedIndividual
type: Concept
created: 2019-02-18T17:22:10
modified: 2020-09-01T18:57:06
alternative label: bundle pier @en
alternative label: pilar de haz @es
broader: Pfeiler
definition: Svazkové pilíře mají kolem sebe seskupeny různě silné, zaoblené nebo žlábkované plné sloupy, polosloupy nebo tříčtvrteční sloupy, které pokračují do klenby nebo arkád jako žebra nebo klenební pasy a podle svého menšího nebo většího průřezu se nazývají buď vedlejší přípory nebo hlavní přípory. [Koch 2008] @cs
definition: Bündelpfeiler, ein Pfeiler, der rundum mit Diensten von größerem und geringerem Durchmesser, sog. alte und junge Dienste, besetzt ist; in der 1. Hälfte des 13. Jhs. aus dem Gliederpfeiler entwickelt und in der Gotik weitverbreitet; teilweise ist der Pfeilerkern nicht mehr sichtbar. [Koepf / Binding 2016]
definition: Ein Pfeiler mit eingebundenen Diensten, zusammenfassend auch Pfeilervorlagen genannt. [Glossarium Artis]
in scheme: Quellennachweis Koepf / Binding 2016
in scheme: Quellennachweis Glossarium Artis
in scheme: Bamberger Vokabular für Historische Architektur
in scheme: Quellennachweis Koch 2008
in scheme: Strukturtypen
preferred label: pilier en faisceau @fr
preferred label: pilar de nervios @es
preferred label: compound pier @en
preferred label: svazkový pilíř @cs
preferred label: piliere @it
broader by shape: Pfeiler

Pfeiler
type: Concept
type: NamedIndividual
narrower: Bündelpfeiler
preferred label: pilíř @cs
preferred label: pilier @fr
preferred label: pilastro @it
preferred label: pilar @es
preferred label: pilarius @la
preferred label: pillar @en

Quellennachweis Glossarium Artis
type: NamedIndividual
type: ConceptScheme

Quellennachweis Koch 2008
type: NamedIndividual
type: ConceptScheme

Bamberger Vokabular für Historische Architektur
type: NamedIndividual
type: ConceptScheme

Quellennachweis Koepf / Binding 2016
type: NamedIndividual
type: ConceptScheme

Strukturtypen
type: NamedIndividual
type: ConceptScheme