Palladio-Motiv
type: Concept
type: NamedIndividual
created: 2019-10-22T10:31:03
modified: 2020-11-21T16:13:18
alternative label: Serliana
alternative label: baie à rythme ternaire @fr
alternative label: Venetian motif @en
alternative label: Serlian motif @en
preferred label: serliana @it
alternative label: baie à la Serlio @fr
alternative label: benátské okno @cs
broader: Bogenstellung
definition: Von Sebastiano Serlio (1475-1554) entwickelte und von Andrea Palladio (1505-1580) weiter ausgestaltete Form der Wand- oder Fenstergliederung, bei der ein mittlerer, breiterer Bogen von zwei schmaleren Öffnungen flankiert wird, die von einem Gebälk (Architrav) in Höhe des Kämpfers überdeckt sind. [Glossarium Artis]
definition: Auch Venezianisches Fenster, in England - weil auf Serlios »Architettura« zurückgehend - Serliomotiv oder Serliana genannte Wandöffnung, bei der eine auf Säulen oder Pfeilern stehende Bogenöffnung von 2 schmalrechteckigen Öffnungen flankiert wird, deren Gebälk in Höhe des Bogenkämpfers verläuft. Von Palladio und seinen Nachfolgern oft verwendet. [Koch 2009]
definition: Bereits von Serlio entwickelte und von Palladio (Basilika in Vicenza) weiterentwickelte Komposition in der Spätrenaissance: Verbindung eines mittleren, breiteren Bogens mit zwei schmaleren Seitenöffnungen, die von einem Gebälk in Höhe des Bogenkämpfers abgeschlossen sind. [Koepf/Binding 2016]
definition: PALLADIOVSKÝ MOTIV, též benátské okno, v Anglii - jelikož vycházel ze Serliova díla "Architettura" - též nazývaný serliovský motiv nebo "serliana"; obloukový otvor ve stěně spočívající na sloupech nebo pilířích, který má po stranách 2 úzké obdélníkové otvory, jejichž kladí probíhá ve výši patky oblouku. Tento motiv často používal Palladio a jeho následovníci. [Koch 2008] @cs
in scheme: Quellennachweis Glossarium Artis
in scheme: Quellennachweis Koch 2009
in scheme: Bamberger Vokabular für Historische Architektur
in scheme: Strukturtypen
in scheme: Quellennachweis Koch 2008
preferred label: composición desarrollada por Serlio y Palladio @es
preferred label: baie palladienne @fr
preferred label: palladiovský motiv @cs
preferred label: Palladian motif @en

Bogenstellung
type: NamedIndividual
type: Concept
narrower: Palladio-Motiv
preferred label: umístění oblouku @cs

Quellennachweis Glossarium Artis
type: NamedIndividual
type: ConceptScheme

Quellennachweis Koch 2008
type: NamedIndividual
type: ConceptScheme

Bamberger Vokabular für Historische Architektur
type: NamedIndividual
type: ConceptScheme

Quellennachweis Koch 2009
type: NamedIndividual
type: ConceptScheme

Strukturtypen
type: NamedIndividual
type: ConceptScheme