Ante
type: NamedIndividual
type: Concept
created: 2020-06-09T16:01:35
modified: 2021-01-22T13:00:45
broader: Gebäudeteil des Tempels
broader: Wand
definition: Předstupující boční zeď antického chrámu, Eleusis, zesílená čelní strana se nazývá antový pilíř. [Koch 2008] @cs
definition: Ante (lat.), die vorgezogenen Seitenwände der Cella, die die Vorhalle des Antentempels bilden. Die stärkere Ausbildung der Antenstirn geht zurück auf das altgr. Megaron, dessen Mauern aus ungebrannten Lehmziegeln an der Stirn durch senkrechte Bohlen geschützt waren. Diese Verstärkung heißt Antenpfeiler und wird von einem Kapitell bekrönt (Antenkapitell). [Koepf / Binding 2016]
definition: Vorspringende Seitenwand des antiken Tempels. Die verstärkte Stirnseite heißt Antenpfeiler. [Koch 2009]
in scheme: Strukturtypen für Sakralbauten
in scheme: Quellennachweis Koch 2009
in scheme: Quellennachweis Koepf / Binding 2016
in scheme: Strukturtypen
in scheme: Quellennachweis Koch 2008
in scheme: Bamberger Vokabular für Historische Architektur
preferred label: anta @la
preferred label: ante @fr
broader by position: Gebäudeteil des Tempels
broader by position: Wand

Wand
type: NamedIndividual
type: Concept
narrower: Ante
preferred label: stěna @cs
preferred label: partition @en
preferred label: paroi @fr
preferred label: parete @it
preferred label: pared @es

Gebäudeteil des Tempels
type: NamedIndividual
type: Concept
narrower: Ante
preferred label: část chrámu @cs

Quellennachweis Koch 2008
type: NamedIndividual
type: ConceptScheme

Bamberger Vokabular für Historische Architektur
type: NamedIndividual
type: ConceptScheme

Quellennachweis Koepf / Binding 2016
type: NamedIndividual
type: ConceptScheme

Quellennachweis Koch 2009
type: NamedIndividual
type: ConceptScheme

Strukturtypen
type: NamedIndividual
type: ConceptScheme

Strukturtypen für Sakralbauten
type: NamedIndividual
type: ConceptScheme