Typologie
type: NamedIndividual
type: Concept
created: 2020-08-12T10:08:20
modified: 2021-01-15T16:05:55
broader: Fachdisziplin
definition: Typologie (griech. Vorbild, Beispiel), Lehre von der Übereinstimmung des Alten und Neuen Testaments (»Concordia veteris et novi testamenti«). Danach sind die Ereignisse des Alten Testaments prophetische Hinweise auf das Neue Testament. Die bildende Kunst stellt daher z.B. gern die 12 Propheten den 12 Aposteln, Elias im feurigen Wagen der Himmelfahrt Christi gegenüber. [Koch 2009]
definition: Řec. vzor, příklad. Nauka o shodě Starého a Nového zákona (,,Concordia veteris et novi testamenti"), podle níž jsou události Starého zákona prorockými odkazy na Nový zákon; výtvarné umění proto staví např. často 12 proroků proti 12 apoštolům, Eliáše v ohnivém voze proti nanebevstoupení Krista. [Koch 2008] @cs
in scheme: Quellennachweis Koch 2008
in scheme: Quellennachweis Koch 2009
in scheme: Bamberger Vokabular für Historische Architektur
in scheme: Begriffe für den Themenkomplex Sakralbau
preferred label: typologie @cs

Fachdisziplin
type: NamedIndividual
type: Concept
narrower: Typologie

Quellennachweis Koch 2008
type: NamedIndividual
type: ConceptScheme

Begriffe für den Themenkomplex Sakralbau
type: NamedIndividual
type: ConceptScheme

Bamberger Vokabular für Historische Architektur
type: NamedIndividual
type: ConceptScheme

Quellennachweis Koch 2009
type: NamedIndividual
type: ConceptScheme