Zwerchgiebel
type: Concept
type: NamedIndividual
created: 2020-04-22T13:50:15
modified: 2021-01-22T12:25:44
alternative label: Querdach
alternative label: příčná sedlová střecha @cs
alternative label: comble transversal @fr
alternative label: Lukarne
alternative label: Zwerchdach
broader: Giebel
definition: Zwerchdach, Dach mit quer zum First des Hauptdaches verlaufendem First. [Koepf/Binding 2016]
definition: Kleiner Giebelaufsatz an der Außenmauer der Traufseite eines Hauses, dessen First quer zum Hauptdach (Dach) verläuft. Sowohl im französischen als auch im deutschen Palast- und Schlossbau der Renaissance spielen Z., die häufig reich verziert sind, eine große Rolle. Oft sind entlang der Traufkante viele kleine Z. aneinandergereiht (Burg Mansfeld S), oder aber ein großer Z. erstreckt sich fast über die gesamte Breite des Hauses. Ist der Z. geschosshoch und befindet sich dahinter ein nutzbarer Raum, spricht man vom Z.-Haus. B. Sch.-W. [Wörterbuch der Burgen, Schlösser und Festungen]
definition: Der Giebel des Zwerchhauses. Er soll zwischen der langen Horizontalen des Dachs und vertikalen Formen ausgleichen. [Koch 2009]
definition: Příčná střecha, zastřešení bočních lodí několika rovnoběžnými sedlovými střechami kolmo k podélné ose kostela, viz vikýř s obytným prostorem. [Koch 2008] @cs
in scheme: Quellennachweis Koch 2009
in scheme: Strukturtypen
in scheme: Strukturtypen für Sakralbauten
in scheme: Strukturtypen für Wohn- und Nutzbauten
in scheme: Quellennachweis Koepf / Binding 2016
in scheme: Bamberger Vokabular für Historische Architektur
in scheme: Quellennachweis Wörterbuch der Burgen, Schlösser und Festungen
in scheme: Quellennachweis Koch 2008
in scheme: Strukturtypen für Burgen und Schlösser
preferred label: toit transversal @fr
preferred label: příčná střecha @cs
preferred label: techo transversal @es
preferred label: tetto trasversale @it
preferred label: transverse roof @en

Giebel
type: NamedIndividual
type: Concept
narrower: Zwerchgiebel
preferred label: štít @cs

Quellennachweis Wörterbuch der Burgen, Schlösser und Festungen
type: NamedIndividual
type: ConceptScheme

Quellennachweis Koch 2008
type: NamedIndividual
type: ConceptScheme

Strukturtypen für Burgen und Schlösser
type: NamedIndividual
type: ConceptScheme

Bamberger Vokabular für Historische Architektur
type: NamedIndividual
type: ConceptScheme

Quellennachweis Koepf / Binding 2016
type: NamedIndividual
type: ConceptScheme

Quellennachweis Koch 2009
type: NamedIndividual
type: ConceptScheme

Strukturtypen für Wohn- und Nutzbauten
type: NamedIndividual
type: ConceptScheme

Strukturtypen
type: NamedIndividual
type: ConceptScheme

Strukturtypen für Sakralbauten
type: NamedIndividual
type: ConceptScheme