Chippendale
type: NamedIndividual
type: Concept
created: 2020-08-04T09:19:48
modified: 2020-08-21T21:44:16
broader: Möbelstil
definition: Angl. národní sloh nábytku kolem r. 1750, nazvaný podle výrobce nábytku Thomase Chippendalea (1709-79); chippendale spojuje prvky a ozdobné tvary z anglického baroka, franc. rokoka, gotiky a Číny do pohodlné účelnosti, oblíbeným materiálem je mahagon. [Koch 2008] @cs
definition: Englischer nationaler Möbelstil um 1750, genannt nach dem Möbeltischler Thomas Chippendale (1709-79). Im Chippendale verbinden sich Elemente und Zierformen des englischen Barock, frz. Rokoko, der Gotik und Chinas zu bequemer Zweckmäßigkeit. Mahagoni ist bevorzugter Werkstoff. [Koch 2009]
in scheme: Bamberger Vokabular für Historische Architektur
in scheme: Quellennachweis Koch 2009
in scheme: Quellennachweis Koch 2008
preferred label: chippendale @cs
related: Barock

Barock
type: NamedIndividual
type: Concept
preferred label: baroko @cs
related: Chippendale

Möbelstil
type: NamedIndividual
type: Concept
narrower: Chippendale

Quellennachweis Koch 2008
type: NamedIndividual
type: ConceptScheme

Bamberger Vokabular für Historische Architektur
type: NamedIndividual
type: ConceptScheme

Quellennachweis Koch 2009
type: NamedIndividual
type: ConceptScheme