Weicher Stil
type: NamedIndividual
type: Concept
created: 2020-08-12T10:25:41
modified: 2020-08-24T14:07:24
broader: Kunststil
definition: Entwicklungsphase der spätgotischen Bildhauerkunst und Malerei, etwa 1380-1430. Charakteristisch sind die ergreifenden Erbärmdebilder, besonders aber die sogenannten »Schönen Madonnen« mit den weichgeschwungenen Gewandfalten und Faltenkaskaden und ihrer anmutig-lieblichen, unfeierlichen Mutter-Kind-Idyllik. Der Weiche Stil wirkt auch auf die zur gleichen Zeit aufkommenden ersten Holzschnitte ein. [Koch 2009]
definition: Vývojová fáze pozdně gotického sochařství a malířství, asi v letech 1380-1430; charakteristické jsou působivé obrazy Krista jako Trpitele, zvl. však tzv. ,,krásné madony" s oděvem s četnými záhyby a kaskádami záhybů a s jejich půvabnou neslavnostní idylikou matky s dítětem; krásný sloh ovlivnil též v té době vznikající první dřevořezby. [Koch 2008] @cs
in scheme: Quellennachweis Koch 2009
in scheme: Bamberger Vokabular für Historische Architektur
in scheme: Quellennachweis Koch 2008
preferred label: krásný sloh @cs
related: Gotik

Kunststil
type: NamedIndividual
type: Concept
narrower: Weicher Stil

Gotik
type: NamedIndividual
type: Concept
preferred label: gotika @cs
related: Weicher Stil

Quellennachweis Koch 2008
type: NamedIndividual
type: ConceptScheme

Bamberger Vokabular für Historische Architektur
type: NamedIndividual
type: ConceptScheme

Quellennachweis Koch 2009
type: NamedIndividual
type: ConceptScheme