Halbkuppel
type: Concept
type: NamedIndividual
created: 2019-09-28T23:16:01
modified: 2021-01-19T12:30:39
alternative label: coupole en cul-de-four plein-cintre @fr
alternative label: semi-dome @en
alternative label: cul-de-four @fr
alternative label: demi-coupole @fr
broader: Kuppel
definition: Größere, jedoch nur über einem Halbkreis bzw. einem halben Polygon errichtete Kuppel mit unterschiedlicher Wölblinie. Beispiel: Die Hagia Sophia in Istanbul. Die kleinere, einer Muschel ähnliche Halbkuppel über einer Apsis wird auch Konche oder Concha genannt. (Glossarium Artis)
definition: Eine Kuppel mit viertelkreisförmigem Querschnitt über halbkreisförmigem Grundriss. Die H. wird oft zur Überwölbung von Apsiden oder halbrunden Nischen verwandt. [Koepf / Binding 2016]
in scheme: Bamberger Vokabular für Historische Architektur
in scheme: Quellennachweis Koepf / Binding 2016
in scheme: Strukturtypen für Sakralbauten
in scheme: Strukturtypen
preferred label: voûte en cul-de-four @fr
preferred label: half dome @en
broader by shape: Kuppel

Kuppel
type: NamedIndividual
type: Concept
narrower: Halbkuppel
preferred label: kupole @cs
preferred label: coupole @fr

Bamberger Vokabular für Historische Architektur
type: NamedIndividual
type: ConceptScheme

Quellennachweis Koepf / Binding 2016
type: NamedIndividual
type: ConceptScheme

Strukturtypen
type: NamedIndividual
type: ConceptScheme

Strukturtypen für Sakralbauten
type: NamedIndividual
type: ConceptScheme