Kirchenmobiliar
type: NamedIndividual
type: Concept
created: 2021-01-13T14:17:58
modified: 2021-01-26T10:49:01
alternative label: church fittings @en
alternative label: meubles d\'une église @fr
alternative label: Kircheneinrichtung
broader: Mobiliar
definition: Kirchenmobiliar n; auch Kircheneinrichtung f; lat. institutio ecclesiastica:alle Möbel und Ausstattungsgegenstände eines Kirchenraumes, die oftauch im Dienste der Liturgie stehen; z. B. Altar , Kathedra, Ambo,Kanzel, Orgel, Chorgestühl, Taufstein, Lesepult, Opferstock und Weihwasserbecken. [Glossarium Artis]
in scheme: Bamberger Vokabular für Historische Architektur
preferred label: mobiliář kostela @cs
preferred label: institutio ecclesiastica @la
preferred label: mobilier d\'une église @fr
preferred label: church furniture @en
broader by position: Mobiliar

Mobiliar
type: NamedIndividual
type: Concept
narrower: Kirchenmobiliar

Bamberger Vokabular für Historische Architektur
type: NamedIndividual
type: ConceptScheme