Treppenturm
type: NamedIndividual
type: Concept
created: 2020-01-21T14:34:05
modified: 2021-01-27T13:51:51
alternative label: torre con scala chiocciola @it
alternative label: Stiegenturm
alternative label: stair turret @en
alternative label: tourelle @fr
alternative label: tourillon @fr
alternative label: věžička se schodištěm @cs
alternative label: Wendelstein
broader: Turm
broader: Gebäudeteil
definition: Treppenturm, Stiegenturm, Wendelstein; turmartiger Gebäudeteil, häufig der Gebäudefront vorgestellt oder in einen Winkel eingefügt, in dessen Innern meist eine Wendeltreppe als Verbindung zu den oberen Geschossen aufsteigt. [Koepf / Binding 2016]
definition: Treppenturm, meist an-, seltener in ein Gebäude eingebauter Turm, in dem eine um eine vertikale Spindel sich drehende Treppe die verschiedenen Stockwerke verbindet. Im frühen Burgenbau oft als schlichte Nutzbauten ausgeführt, waren die T.e in der Spätgotik und im Schlossbau der Renaissance aufwändig gestaltet. B. Sch.-W. . [Wörterbuch der Burgen, Schlösser und Festungen]
definition: Věž s točitým schodištěm, v románské době i s rampou (,,oslí věž"); často na bocích románských a gotických kostelů v symetrickém párovém uspořádání. [Koch 2008] @cs
definition: Auch Wendelstein, Turm mit Wendeltreppe, in der Romanik auch mit stufenlosem Lauf (»Eselsturm«). Flankiert den Außenbau romanischer und gotischer Kirchen oft in symmetrisch-paariger Anordnung. [Koch 2009]
in scheme: Strukturtypen für Burgen und Schlösser
in scheme: Quellennachweis Koch 2008
in scheme: Bamberger Vokabular für Historische Architektur
in scheme: Quellennachweis Koch 2009
in scheme: Quellennachweis Wörterbuch der Burgen, Schlösser und Festungen
in scheme: Strukturtypen für Wohn- und Nutzbauten
in scheme: Strukturtypen für Sakralbauten
in scheme: Strukturtypen
in scheme: Quellennachweis Koepf / Binding 2016
preferred label: stair tower @en
preferred label: tour d\'escalier @fr
preferred label: torre delle scale @it
preferred label: torre con escalera de caracol @es
preferred label: schodišťová věž @cs

Gebäudeteil
type: NamedIndividual
type: Concept
narrower: Treppenturm
preferred label: část budovy @cs

Turm
type: NamedIndividual
type: Concept
narrower: Treppenturm
preferred label: věž @cs
preferred label: tower @en
preferred label: tour @fr
preferred label: torre @it

Quellennachweis Wörterbuch der Burgen, Schlösser und Festungen
type: NamedIndividual
type: ConceptScheme

Quellennachweis Koch 2008
type: NamedIndividual
type: ConceptScheme

Strukturtypen für Burgen und Schlösser
type: NamedIndividual
type: ConceptScheme

Bamberger Vokabular für Historische Architektur
type: NamedIndividual
type: ConceptScheme

Quellennachweis Koepf / Binding 2016
type: NamedIndividual
type: ConceptScheme

Quellennachweis Koch 2009
type: NamedIndividual
type: ConceptScheme

Strukturtypen für Wohn- und Nutzbauten
type: NamedIndividual
type: ConceptScheme

Strukturtypen
type: NamedIndividual
type: ConceptScheme

Strukturtypen für Sakralbauten
type: NamedIndividual
type: ConceptScheme