Wehrgang
type: Concept
type: NamedIndividual
created: 2019-04-09T17:34:55
modified: 2021-01-27T15:36:55
alternative label: bojový ochoz @cs
alternative label: wall walk @en
alternative label: krytý ochoz @cs
alternative label: Mordgang
alternative label: Letze
alternative label: Hurde
broader: Verbindungsbau
broader: Wehr- und Schutzanlage
definition: Verteidigungsgang auf einer Wehrmauer (Stadt-, Burg-oder Landmauer, Wehrkirche).Der W. liegt entweder hinter der Mauer auf einer auskragenden Holzkonstruktion und ist gegen die Feindseite durch Schießscharten oder Zinnen geöffnet, oder er kragt über Konsolen mit zwischenliegenden Maschikulisund Zinnen darüber nach außen vor, er kann aber auch hinter einer schmalen Brüstungsmauer (Brustwehr) auf der Ringmauerauf ruhen. Ebenso kann der W. auf der Mauer aufsitzen als beidseitig auskragender Holzaufbau (Hurde). Die Brustwehrh at entweder Schießscharten oder besteht aus wechselnd rechteckigen, nicht überdeckten Maueröffnungen (Zinnenfenster,Zinnenscharte) und geschlossenen Mauerstücken (Zinne), die je nach Gegend und Zeit verschieden geformt sind. Der W. kann an den Mauerecken in kleine vorkragende Türmchen (Scharwachtturm) einmünden.Er kann überdacht sein, um den Verteidiger vor Beschuss vonoben zu schützen, auch mehrgeschossige W.e kommen vor. [Koepf / Binding 2016]
definition: Obranná chodba na hradbě. [Koch 2008] @cs
definition: Der obere Abschluss von Mauern, besonders Ring-, aber auch Zwingermauern zur Verteidigung. Der W. sollte üblicherweise so breit sein, dass im Verteidigungsfall zwei Männer gleichzeitig passieren konnten, also mindestens 1,2 m breit. Bei geringen Mauerstärken, insbesondere bei Zwingermauern, war es daher häufig nötig, ihn innen vorkragen zu lassen. Davon zeugen insbesondere Kragsteine, Bogenfriese, aber auch Arkaden. Besonders bei hölzernen W.en kamen auch hölzerne Stützen (als horizontale Auflagen oder Schrägstreben) zur Anwendung. Nach außen schloss der W. meist bündig ab und war mit einer hölzernen oder steinernen Brustwehr, Zinnen und Schießscharten bestückt. Besonders im Spätmittelalter konnte der W. gelegentlich auch außen leicht vorkragen, auf Kragsteinen oder einem Bogenfries ruhend. Regelmäßige Öffnungen unterhalb der Brustwehr konnten im Bedarfsfall zur zusätzlichen Aufschlagung hölzerner, vorkragender W.e dienen (Hurden; Carcassonne F). W.e konnten auch überdacht werden, zuweilen waren sie innen ebenfalls mittels Holz oder Fachwerk geschlossen, während beidseitig ausgebildete Brustwehren selten vorkommen (Bellinzona CH), am häufigsten noch bei Schildmauern (Ehrenfels HE). Bei entsprechend hohen Mauern konnten W.e auch mehrgeschossig ausgeführt sein (Ortenberg im Elsass F). R. F. [Wörterbuch der Burgen, Schlösser und Festungen]
definition: Verteidigungsgang auf einer Wehrmauer. [Koch 2009]
in scheme: Bamberger Vokabular für Historische Architektur
in scheme: Quellennachweis Wörterbuch der Burgen, Schlösser und Festungen
in scheme: Strukturtypen
in scheme: Quellennachweis Koch 2009
in scheme: Quellennachweis Koch 2008
in scheme: Quellennachweis Koepf / Binding 2016
in scheme: Strukturtypen für Burgen und Schlösser
preferred label: adarve @es
preferred label: hradební ochoz @cs
preferred label: alure @en
preferred label: chemin de ronde @fr
preferred label: cammino di ronda @it

Wehr- und Schutzanlage
type: NamedIndividual
type: Concept
narrower: Wehrgang
preferred label: opevnění @cs

Verbindungsbau
type: NamedIndividual
type: Concept
narrower: Wehrgang

Quellennachweis Wörterbuch der Burgen, Schlösser und Festungen
type: NamedIndividual
type: ConceptScheme

Quellennachweis Koch 2008
type: NamedIndividual
type: ConceptScheme

Strukturtypen für Burgen und Schlösser
type: NamedIndividual
type: ConceptScheme

Bamberger Vokabular für Historische Architektur
type: NamedIndividual
type: ConceptScheme

Quellennachweis Koepf / Binding 2016
type: NamedIndividual
type: ConceptScheme

Quellennachweis Koch 2009
type: NamedIndividual
type: ConceptScheme

Strukturtypen
type: NamedIndividual
type: ConceptScheme