Palas
type: Concept
type: NamedIndividual
created: 2020-06-23T13:25:57
modified: 2021-01-27T00:50:11
broader: Wohnbau
definition: Ve středověku obytný panský dům na hradě, také výstavný šlechtický dům. [Koch 2008] @cs
definition: Palas m (lat. palatium), benannt nach dem Palatin in Rom, d. h. dem Ort der antik-römischen Kaiserpaläste. Über das afrz. »palais« kam es im späteren 12. Jh. in das Deutsche und bildete auch die Sprachwurzel von »Palast«. In dessen umfassender Bedeutung bezeichnete P. im Hochmittelalter den gesamten Hauptwohn- und -repräsentationskomplex einer Burg und Pfalz, bezog sich also nicht auf einen Saalbau im engeren Sinn, auch wenn ein großer Saal dominierendes Raumelement war. Erst seit dem 19. Jh. wurde der Begriff mehr und mehr zur reinen Bezeichnung primär von Saalbauten vor allem hochmittelalterlicher Zeit eingeschränkt. Als neutraleres Pendant hat sich inzwischen Saalgeschossbau einzubürgern begonnen. C. M. [Wörterbuch der Burgen, Schlösser und Festungen]
in scheme: Strukturtypen für Wohn- und Nutzbauten
in scheme: Quellennachweis Koch 2008
in scheme: Strukturtypen
preferred label: palác (středověkého hradu) @cs
broader by function: Wohnbau

Wohnbau
type: NamedIndividual
type: Concept
narrower: Palas
preferred label: residential building @en
preferred label: obytná budova @cs
preferred label: habitation @fr
preferred label: edificio d\'abitazione @it
preferred label: construcción habitacional @es

Quellennachweis Koch 2008
type: NamedIndividual
type: ConceptScheme

Strukturtypen für Wohn- und Nutzbauten
type: NamedIndividual
type: ConceptScheme

Strukturtypen
type: NamedIndividual
type: ConceptScheme