Nonnenchor
type: NamedIndividual
type: Concept
created: 2020-08-04T13:13:42
modified: 2021-01-22T12:25:11
alternative label: Prieche
alternative label: kruchta jeptišek @cs
alternative label: empora jeptišek @cs
alternative label: chór jeptišek @cs
alternative label: galería de las monjas @es
alternative label: Nonnenempore
broader: Empore
definition: Zpravidla v západní části, nebo jsou na ní umístěny varhany (též kruchta, většinou na západě), nebo má především členící funkci. Zvláště v románské době empory otvíraly stěny chrámové lodi a představovaly třecí rytmický prvek mezi arkádami v přízemí a horní okenní stěnou. V renesančních a barokních emporových kostelích zasahovala empora až do klenby a nabývala zároveň většího prostorového významu. Empora však není nezbytnou součástí chrámového prostoru. V centrální stavbě se nachází nad ochozem, v bazilice nad bočními loděmi, v příčné lodi, nebo nad západním vchodem, v halových nebo jednolodních kostelích stojí na vlastní konstrukci a bývala často zabudována až dodatečně, především v reformovaných kostelích. [Koch 2008] @cs
definition: Empora jeptišek v ženském klášteře. [Koch 2008] @cs
definition: Emporenraum; Empore in Damenstifts- und Nonnenklosterkirchen, die der Abschirmung der Nonnen von den übrigen Teilnehmern am Gottesdienst diente, meist mit Altar, Orgel und Chorgestühl. Die N. lag meist im W, seltener auch über den Seitenschiffen oder in einem Querhausarm. Sie kann bühnenartig über Säulenstellungen weit in das Mittelschiff hineingezogen werden oder auf den Westbau beschränkt bleiben. [Koepf/Binding 2016]
definition: Prieche, Nonnenempore im Frauenkloster oder Damenstift. [Koch 2009]
in scheme: Quellennachweis Koch 2008
in scheme: Strukturtypen
in scheme: Strukturtypen für Sakralbauten
in scheme: Bamberger Vokabular für Historische Architektur
in scheme: Quellennachweis Koch 2009
preferred label: coro de las monjas @es
preferred label: nun\'s gallery @en
preferred label: matroneo delle monache @it
preferred label: tribune de religieuse @fr
preferred label: tribuna jeptišek @cs

Empore
type: NamedIndividual
type: Concept
narrower: Nonnenchor
preferred label: empora @cs

Quellennachweis Koch 2008
type: NamedIndividual
type: ConceptScheme

Bamberger Vokabular für Historische Architektur
type: NamedIndividual
type: ConceptScheme

Quellennachweis Koch 2009
type: NamedIndividual
type: ConceptScheme

Strukturtypen
type: NamedIndividual
type: ConceptScheme

Strukturtypen für Sakralbauten
type: NamedIndividual
type: ConceptScheme