Gewölbe
type: NamedIndividual
type: Concept
narrower: Fächergewölbe (engere Bedeutung)
preferred label: voûte @fr
preferred label: vault @en
preferred label: klenba @cs

Fächergewölbe (engere Bedeutung)
type: NamedIndividual
type: Concept
created: 2019-02-18T23:19:20
modified: 2021-01-19T12:13:21
alternative label: voûte en calice @fr
alternative label: palm vault @en
alternative label: volta a ventaglio @it
alternative label: Strahlengewölbe
alternative label: fan groning @en
alternative label: Palmengewölbe
alternative label: voûte palmiforme @fr
alternative label: fan tracery vault @en
broader: Gewölbe
definition: Im engeren Sinne eine vor allem in England vorkommende Gewölbeform, bei der zahlreiche Rippen gleicher Länge und gleicher Krümmung strahlenförmig von den auf der Wand liegenden Stützen ausgehen (Fächer). Die Füllungen zwischen den Rippen sind häufig mit einem reichen, maßwerkähnlichen Dekor bedeckt. Die konisch geformten Rippenbündel werden in der Regel durch kreisförmige Rippen begrenzt. [Glossarium Artis]
definition: Gewölbe mit vom Auflager fächerförmig ausgehenden Rippen, hauptsächl. in der engl. Gotik vorkommend. [Koepf/Binding 2016]
definition: Fächergewölbe, Palmengewölbe; ein durch zahlr. vom Scheitel bzw. von einer Stütze ausgehende Rippen unterteiltes Gewölbe. [Koepf / Binding 2016]
definition: Fächergewölbe, Strahlengewölbe, Palmengewölbe; in der engl. Spätgotik beliebte, auch in den Bauten des Deutschen Ordens vorkommende Gewölbeform, deren Rippen fächerförmig von einem Stützpunkt ausstrahlen. [Koepf / Binding 2016]
definition: Rozvíjí žebra vějířovitě jednoho bodu. Rozšířena zvl. v anglické pozdní gotice a také na kontinentu (refektář v Malborku). U hvězdové, síťové a vějířové klenby se mohou vyskytovat volné kombinace několika druhů žeber (viz liernová klenba = klenba s doplňkovými ozdobnými žebry): a) hlavní žebra (křížové, příčné a vrcholové žebro), b) riercerony (žebra 2. stupně, která stoupají od patek v rozích klenebních polí k vrcholovému žebru, někdy vedou také k příčnému žebru, ale nedotýkají se hlavního svorníku), c) lierny (žebra 3.,srupně, ozdobná, nedotýkají se rohů klenebních polí). [Koch 2008] @cs
in scheme: Strukturtypen
in scheme: Bamberger Vokabular für Historische Architektur
in scheme: Quellennachweis Koch 2008
in scheme: Strukturtypen für Sakralbauten
in scheme: Quellennachweis Glossarium Artis
preferred label: fan vault @en
preferred label: vějířová klenba @cs
preferred label: voûte en éventails @fr
preferred label: bóveda palmiforme @es
broader by shape: Gewölbe

Quellennachweis Glossarium Artis
type: NamedIndividual
type: ConceptScheme

Quellennachweis Koch 2008
type: NamedIndividual
type: ConceptScheme

Bamberger Vokabular für Historische Architektur
type: NamedIndividual
type: ConceptScheme

Strukturtypen
type: NamedIndividual
type: ConceptScheme

Strukturtypen für Sakralbauten
type: NamedIndividual
type: ConceptScheme