Modul
type: Concept
type: NamedIndividual
created: 2020-08-12T11:16:22
modified: 2021-01-15T18:00:53
broader: Proportionslehre
definition: 1. Model, Modul (lat. modulus = kleines Maß), der halbe untere Säulendurchmesser antiker Säulen als Einheit für die Maßverhältnisse der Säulenordnung (Interkolumnium). Bei Teilung durch 30 ergeben sich die Minuten (Partes); 2. Ausgangseinheit verschiedener Proportionslehren, z.B. Le Corbusiers »Modulor «; 3. Durchmesser einer Münze oder einer Medaille. [Koch 2009]
definition: Lat. modulus = malá míra. 1. Poloviční spodní průměr antických sloupů jako jednotka proporcí sloupového řádu (interkolumnium), při dělení třiceti vznikají minuty (partes). 2. Výchozí jednotka různých proporčních systémů, např. Le Corbusierův „modulor". [Koch 2008] @cs
in scheme: Quellennachweis Koch 2008
in scheme: Begriffe für den Themenkomplex Sakralbau
in scheme: Quellennachweis Koch 2009
in scheme: Bamberger Vokabular für Historische Architektur
preferred label: modul @cs

Proportionslehre
type: NamedIndividual
type: Concept
narrower: Modul
preferred label: proporční systém @cs

Quellennachweis Koch 2008
type: NamedIndividual
type: ConceptScheme

Begriffe für den Themenkomplex Sakralbau
type: NamedIndividual
type: ConceptScheme

Bamberger Vokabular für Historische Architektur
type: NamedIndividual
type: ConceptScheme

Quellennachweis Koch 2009
type: NamedIndividual
type: ConceptScheme