Wartturm
type: Concept
type: NamedIndividual
created: 2020-04-28T16:12:15
modified: 2021-01-27T13:53:37
alternative label: Luginsland
alternative label: Wachtturm
alternative label: hláska @cs
alternative label: watch tower @en
alternative label: Warte
alternative label: Burgwarte
broader: Turm
definition: (mhd., ›spähendes Ausschauen‹, auch Wartturm, Wachtturm) In Form einzeln stehender, von Wall und Graben umgebener (Rund-)Türme, oft Teil des vorgeschobenen Befestigungsrings bzw. Rechtsbezirks einer Stadt (Frankfurt a. M. HE, Grünberg HE). W.n entstanden häufiger im 14./15. Jh.; sie umgaben das Weichbild der Städte in Sichtweite und boten so Warnmöglichkeiten (Fritzlar HE). Noch heute sind in Deutschland viele Einzeltürme, teils inmitten moderner Großstädte (Bockenheimer Warte / Frankfurt a. M. HE), erhalten. Ab dem Ende des 15. Jhs. waren W.n öfter mit Landwehren verbunden. Manche W.n übernahmen Burgfunktionen. M. L. [Wörterbuch der Burgen, Schlösser und Festungen]
definition: Warte, Wachtturm, außerhalb von ma. Städten auf Anhöhen liegender Turm zur Beobachtung herannahender Feinde. [Koepf / Binding 2016]
definition: Mittelalterlicher Turm, der mit einer Plattform versehen ist, um von dort ein Lager, eine Grenze oder ein Vorgelände einer Stadt oder Burg zu beobachten, auch auf Anhöhen vor der Stadt oder an den Grenzen eines Hoheitsbereichs gelegen, untereinander und mit der Stadt oder Burg in Sichtverbindung. [Koepf / Binding 2016]
definition: Burgwarte, Wartturm, ein in der Verteidigungsanlage einer ma. Burg stehender Turm, danach auch häufig Bezeichnung für einen vorgeschobenen, meist hoch gelegenen Wartturm einer ma. Stadt, von dem aus die Bewegungen herannahender Feinde frühzeitig erkannt werden konnten. [Koepf / Binding 2016]
in scheme: Bamberger Vokabular für Historische Architektur
in scheme: Quellennachweis Wörterbuch der Burgen, Schlösser und Festungen
in scheme: Quellennachweis Koepf / Binding 2016
in scheme: Strukturtypen
in scheme: Strukturtypen für Burgen und Schlösser
narrower: Hochwacht
preferred label: atalaya @es
preferred label: tour de guet @fr
preferred label: torre di vedetta @it
preferred label: strážní věž @cs
preferred label: lookout tower @en

Hochwacht
type: NamedIndividual
type: Concept
broader: Wartturm

Turm
type: NamedIndividual
type: Concept
narrower: Wartturm
preferred label: věž @cs
preferred label: tower @en
preferred label: tour @fr
preferred label: torre @it

Quellennachweis Wörterbuch der Burgen, Schlösser und Festungen
type: NamedIndividual
type: ConceptScheme

Strukturtypen für Burgen und Schlösser
type: NamedIndividual
type: ConceptScheme

Bamberger Vokabular für Historische Architektur
type: NamedIndividual
type: ConceptScheme

Quellennachweis Koepf / Binding 2016
type: NamedIndividual
type: ConceptScheme

Strukturtypen
type: NamedIndividual
type: ConceptScheme