eingezogener Strebepfeiler
type: NamedIndividual
type: Concept
broader: Strebepfeiler
preferred label: pilar de arbotante @es
preferred label: contrefort intérieur @fr

Strebepfeiler
type: Concept
type: NamedIndividual
created: 2019-02-18T17:33:16
modified: 2021-01-22T17:27:45
alternative label: Strebe
alternative label: opěrák @cs
alternative label: counterfort @en
alternative label: abutment @en
alternative label: Verstärkungspfeiler
alternative label: éperon @fr
alternative label: sperone @it
alternative label: buttress @en
alternative label: contrafuerte @es
broader: Pfeiler
broader: Strebewerkelement
definition: Strebepfeiler, pfeilerartige Mauerverdickung an einem Punkt, der hohen Druck- und Schubkräften ausgesetzt ist, meist schräg gegen eine Mauer gestellt oder abgekafft, nach außen vorspringend oder nach innen eingezogen. Bei Basiliken in der Umfassungsmauer der Seitenschiffe angefügt und mit Strebebogen versehen. [Koepf / Binding 2016]
definition: Eine pfeilerartige Mauerverstärkung an einem Punkt, der hohen Druck- und Schubkräften ausgesetzt ist; meist schräg gegen eine Mauer gestellt bzw. abgekafft, nach außen vorspringend oder auch nach innen eingezogen. Bei mehrschiffigen Kirchen an der Außenmauer der Seitenschiffe gelegen und oft mit Strebebogen versehen. [Glossarium Artis]
definition: Teil des Strebewerks, eines konstruktiven Verspannungssystems von Strebepfeiler und Strebebogen. Der Strebepfeiler verstärkt die Außenmauer, dient als Auflager für den Strebebogen, der wiederum die Last auf einen kleineren Strebepfeiler abträgt bis zum Fundament. [Schrader / Voigt 2003]
definition: Strebepfeiler, ein quer zur Längsflucht einer Mauer stehendes Mauerstück, das zur Verstärkung und Ableitung von Schubkräften dient. Er kann sich nach oben hin verjün-gen, meist unter Einfügung eines Wasserschlages. S. werden im Burgenbau viel seltener verwendet als im Sakralbau, gelegentlich werden damit die Ringmauern ( Mauer) ver-stärkt, besonders wenn diese sich über einem steil abfallenden Grund erheben. Werden die S. regelmäßig angebracht, kann auf sie auch der Wehrgang aufgelegt werden (Freien-fels HE, Windeck BW). B. Sch.-W. [Wörterbuch der Burgen, Schlösser und Festungen]
in scheme: Bamberger Vokabular für Historische Architektur
in scheme: Strukturtypen
in scheme: Quellennachweis Koepf / Binding 2016
in scheme: Quellennachweis Schrader / Voigt 2003
in scheme: Quellennachweis Glossarium Artis
narrower: eingezogener Strebepfeiler
narrower: abgekaffter Strebepfeiler
narrower: geböschter Strebepfeiler
preferred label: contrefort @fr
preferred label: botarel @es
preferred label: buttress pier @en
preferred label: opěrný pilíř @cs
preferred label: contrafforte @it
related: Tabernakel
related: Strebewerk
broader by function: Pfeiler

Strebewerkelement
type: NamedIndividual
type: Concept
narrower: Strebepfeiler

geböschter Strebepfeiler
type: NamedIndividual
type: Concept
broader: Strebepfeiler
preferred label: sloping buttress pier @en
preferred label: contrefort taluté @fr
broader by shape: Strebepfeiler

Pfeiler
type: Concept
type: NamedIndividual
narrower: Strebepfeiler
preferred label: pilíř @cs
preferred label: pilier @fr
preferred label: pilastro @it
preferred label: pilar @es
preferred label: pilarius @la
preferred label: pillar @en

abgekaffter Strebepfeiler
type: NamedIndividual
type: Concept
broader: Strebepfeiler
preferred label: weathered buttress pier @en
preferred label: contrefort amorti @fr
broader by shape: Strebepfeiler

Strebewerk
type: NamedIndividual
type: Concept
preferred label: étanconnage @fr
preferred label: opěrný systém @cs
preferred label: contraffortatura @it
preferred label: buttressing @en
preferred label: contrafuerte @es
related: Strebepfeiler

Tabernakel
type: NamedIndividual
type: Concept
preferred label: tabernaculum @la
preferred label: tabernákl @cs
related: Strebepfeiler

Quellennachweis Glossarium Artis
type: NamedIndividual
type: ConceptScheme

Quellennachweis Schrader / Voigt 2003
type: NamedIndividual
type: ConceptScheme

Bamberger Vokabular für Historische Architektur
type: NamedIndividual
type: ConceptScheme

Quellennachweis Koepf / Binding 2016
type: NamedIndividual
type: ConceptScheme

Strukturtypen
type: NamedIndividual
type: ConceptScheme