Terracotta (Tonprodukt)
type: NamedIndividual
type: Concept
preferred label: terracotta (product of clay) @en
preferred label: terakota @cs
related: Terracotta

Terracotta
type: Concept
type: NamedIndividual
created: 2020-08-06T10:30:54
modified: 2020-08-31T16:54:48
broader: Keramik
definition: Terrakotta (lat. terra = Erde, ital. cotta = gebrannt), Tonerde, die durch den Brand weiß, gelb, braun oder rot wird. Wegen ihrer Wetterbeständigkeit oft als Bau-Keramik (Tempelgiebel, Stirnziegel) oder zu Tonbildwerken verwendet (altgriech. Tanagrafigürchen; in der Renaissance besonders durch Donatello, Robbia angewandt). [Koch 2009]
definition: Unglasierter, gebrannter Ton als Baukeramik, meist dekoriert (Fries) und mit Reliefs geschmückt. [Koepf / Binding 2016]
in scheme: Bamberger Vokabular für Historische Architektur
in scheme: Quellennachweis Koch 2009
related: Terracotta (Baumaterial)
related: Terracotta (Tonprodukt)

Terracotta (Baumaterial)
type: NamedIndividual
type: Concept
preferred label: terracotta @en
related: Terracotta

Keramik
type: NamedIndividual
type: Concept
narrower: Terracotta
preferred label: keramika @cs
preferred label: ceramic @en

Bamberger Vokabular für Historische Architektur
type: NamedIndividual
type: ConceptScheme

Quellennachweis Koch 2009
type: NamedIndividual
type: ConceptScheme