Aquarellmalerei
type: NamedIndividual
type: Concept
created: 2020-05-18T13:30:05
modified: 2021-01-18T13:58:58
broader: Malereitechnik
definition: Aquarellmalerei (lat. aqua = Wasser), lasierende Malereitechnik (lässt den Grund durchscheinen) mit wasserlöslichen Farben ohne Weiß. Bindemittel: Gummi arabicum. Am Bau für Fresko-Malerei (sh. dort). [Koch 2009]
definition: Akvarel (lat. aqua = voda), průhledná malba (prosvěcuje podklad) vodou ředitelnými barvami kromě bílé, pojivo: arabská guma, v architektuře při malbě fresek. [Koch 2008] @cs
in scheme: Quellennachweis Koch 2008
in scheme: Bamberger Vokabular für Historische Architektur
in scheme: Quellennachweis Koch 2009
in scheme: Begriffe für den Themenkomplex Sakralbau
preferred label: akvarel @cs

Malereitechnik
type: NamedIndividual
type: Concept
narrower: Aquarellmalerei
preferred label: malířské techniky @cs

Quellennachweis Koch 2008
type: NamedIndividual
type: ConceptScheme

Begriffe für den Themenkomplex Sakralbau
type: NamedIndividual
type: ConceptScheme

Bamberger Vokabular für Historische Architektur
type: NamedIndividual
type: ConceptScheme

Quellennachweis Koch 2009
type: NamedIndividual
type: ConceptScheme