Lehmziegelmauerwerk
type: Concept
type: NamedIndividual
created: 2019-05-07T17:34:39
modified: 2020-06-30T12:36:07
alternative label: Adobe (Mauerwerk)
broader: Mauerwerk
definition: Mauerwerk aus getrockneten, ungebrannten, handgefertigten Lehmziegeln, die aus einer Mischung aus Lehm, Sand, Schluff und kleinen Mengen Stroh (oder anderen Fasermaterialien) sowie Wasser angefertigt werden. Das Rohmaterial kann auch als Verputzmaterial benutzt werden. [EwaGlos]
definition: Unfired clay masonry made of sun-dried handmade bricks that are formed from a mixture of clay soil, sand, silt and a small amount of straw (or other fibrous materials), and water. The raw material can also be used as a plastering material. [EwaGlos] @en
in scheme: Strukturtypen
in scheme: Bamberger Vokabular für Historische Architektur
in scheme: Quellennachweis EwaGlos
preferred label: Brique de terre crue @fr
preferred label: adobe @en
broader by construction material: Mauerwerk

Mauerwerk
type: Concept
type: NamedIndividual
narrower: Lehmziegelmauerwerk
preferred label: opera muraria @it
preferred label: masonry @en
preferred label: opus @la
preferred label: zdivo @cs
preferred label: maçonnerie @fr
preferred label: mampostería @es

Bamberger Vokabular für Historische Architektur
type: NamedIndividual
type: ConceptScheme

Strukturtypen
type: NamedIndividual
type: ConceptScheme

Quellennachweis EwaGlos
type: NamedIndividual
type: ConceptScheme