Aufblättern
type: Concept
type: NamedIndividual
created: 2019-05-08T19:06:00
modified: 2021-01-30T16:34:32
broader: Schichtparalelle Ablösung
definition: Détachement de multiples couches, subparallèles à la surface de la pierre. Quand les couches détachées sont fines (épaisseur centimétrique), elles peuvent présenter des plis, des torsions, [ICOMOS-ISCS] @en
definition: Detachment of multiple thin stone layers (cm scale) that are sub-parallel to the stone surface. The layers may bend, twist in a similar way as book pages. [ICOMOS-ISCS] @fr
definition: Je podtyp oddělování vrstev, přikterém nastává mnohonásobné oddělování tenkýchkamenných vrstviček (řádově centimetrové tloušťky), subparalelníchs povrchem kamene. Vrstvy mohou být ohnuté azkroucené podobným způsobem jako listy v knize. [ICOMOS-ISCS] @cs
definition: Ablösung von zahlreichen dünnen Steinschichten (Zentimeter Maßstab), die subparallel zur Steinoberfläche verlaufen. Die Schichten können sich verbiegen oder verdrehen in ähnlicher Weise wie Buchseiten. [ICOMOS-ISCS]
in scheme: Begriffe für Naturstein- und Wandmalereirestaurierung
in scheme: Bamberger Vokabular für Historische Architektur
in scheme: Begriffe für Bauerhalt
in scheme: Quellennachweis ICOMOS-ISCS
preferred label: exfoliation @en
preferred label: lístkování @cs

Schichtparalelle Ablösung
type: NamedIndividual
type: Concept
narrower: Aufblättern
preferred label: délitage @fr
preferred label: delamination @en
preferred label: oddělení vrstev @cs

Begriffe für Bauerhalt
type: NamedIndividual
type: ConceptScheme

Quellennachweis ICOMOS-ISCS
type: NamedIndividual
type: ConceptScheme

Bamberger Vokabular für Historische Architektur
type: NamedIndividual
type: ConceptScheme

Begriffe für Naturstein- und Wandmalereirestaurierung
type: NamedIndividual
type: ConceptScheme