Bildende Kunst
type: NamedIndividual
type: Concept
narrower: Bildhauerkunst
preferred label: výtvarné umění @cs

Bildhauerkunst
type: NamedIndividual
type: Concept
created: 2020-08-03T15:24:58
modified: 2021-01-15T15:59:39
broader: Bildende Kunst
definition: Bildnerei, seit den Anfängen der Geschichte vorhandene körperbildende Kunst. Formen: Vollplastik und Relief (Bauplastik). Materialien: Bronze, Stein, Holz, Ton, Elfenbein, Wachs, Edelmetalle, Kunststoffe u. a. [Koch 2009]
definition: Umění vytvářející od počátku dějin hmotná, trojrozměrná díla. Druhy: plná plastika a reliéf (viz architektonická plastika). Materiály: bronz, kámen, dřevo, hlína, slonovina, vosk, ušlechtilé kovy, plastické hmoty aj. [Koch 2008] @cs
in scheme: Begriffe für den Themenkomplex Sakralbau
in scheme: Bamberger Vokabular für Historische Architektur
in scheme: Quellennachweis Koch 2009
in scheme: Quellennachweis Koch 2008
preferred label: sochařství @cs

Quellennachweis Koch 2008
type: NamedIndividual
type: ConceptScheme

Begriffe für den Themenkomplex Sakralbau
type: NamedIndividual
type: ConceptScheme

Bamberger Vokabular für Historische Architektur
type: NamedIndividual
type: ConceptScheme

Quellennachweis Koch 2009
type: NamedIndividual
type: ConceptScheme