Wetterschenkel
type: Concept
type: NamedIndividual
created: 2019-06-18T16:03:42
modified: 2021-01-22T19:15:18
alternative label: okapnice @cs
alternative label: gocciolatoio (della finestra) @it
alternative label: vodní rameno @cs
alternative label: botaguas @es
alternative label: water drip @en
alternative label: jet d\'eau @fr
alternative label: Wasserschenkel
alternative label: revers d\'eau @fr
broader: Holzbauelement (Fenster)
broader: Türblattelement
definition: Wasserschenkel, unterer Schenkel nach innen aufgehender Flügel eines Fensters oder einer Außentür mit einer Wassernase. [Koepf / Binding 2016]
definition: Zum Schutz vor eindringendem Niederschlagswasser zwischen Fensterflügel und Fensterrahmen ausgebildeter Unterschenkel am Fensterflügel, technisches Profil. An der Unterseite des Wetterschenkels befindet i. d. R. die Wassernase, auch Tropfkante genannt. [Noky 1996]
definition: Die rahmenden Hölzer des Fensterflügels. Der untere S. eines nach innen aufgehenden Außenflügels ist mit einer außen vorspringenden Wassernase versehen und heißt daher Wetters. oder Wassers. [Koepf / Binding 2016]
definition: Hölzernes profiliertes Bauteil bei Fenstern und Türen. Bei der Tür kann es am Rahmen oben, in der Mitte und unten angebracht sein. Oben schützt es z. B. die Oberkante einer überschobenen Füllung, in der Mitte bei einer Zweifüllungstür die Mittelfuge, unten die Sockelfuge gegen Schlagregen. Bei Fenstern tauchte der Wasserschenkel ebenfalls um 1700 auf und schützt bei Anbringung an dem unteren Flügelholz bei nach innen zu öffnende Fenster gegen Schlagregen. Die Oberkante des Wetterschenkels wird abgerundet oder abgeschrägt, damit das Wasser nicht auf der Fläche stehen bleibt. Die Unterkante wird meist zusätzlich mit einer Wassernase zum besseren Abtropfen des Wassers versehen. [Schrader / Voigt 2003]
definition: Waagerecht außen (bei nach außen öffnenden Fenstern auch Kämpfer und oberes Rahmenholz) auf der unteren Flügelweite in voller Flügelbreite sitzendes Holzteil, das darunter liegende Fugen vor Schlagregen schützt. [Pax - Fenster & Türen Fachbegriffe]
in scheme: Strukturtypen
in scheme: Quellennachweis Noky 1996
in scheme: Bamberger Vokabular für Historische Architektur
in scheme: Quellennachweis Schrader / Voigt 2003
in scheme: Quellennachweis Pax - Fenster & Türen Fachbegriffe
preferred label: weather groove @en
preferred label: reverseau @fr
preferred label: vierteaguas @es
preferred label: okapní lišta @cs

Türblattelement
type: NamedIndividual
type: Concept
narrower: Wetterschenkel
preferred label: části dveřního křídla @cs

Holzbauelement (Fenster)
type: NamedIndividual
type: Concept
narrower: Wetterschenkel

Quellennachweis Schrader / Voigt 2003
type: NamedIndividual
type: ConceptScheme

Bamberger Vokabular für Historische Architektur
type: NamedIndividual
type: ConceptScheme

Quellennachweis Noky 1996
type: NamedIndividual
type: ConceptScheme

Quellennachweis Pax - Fenster & Türen Fachbegriffe
type: NamedIndividual
type: ConceptScheme

Strukturtypen
type: NamedIndividual
type: ConceptScheme