Figürliche Bauskulptur
type: NamedIndividual
type: Concept
narrower: Neidkopf

Neidkopf
type: NamedIndividual
type: Concept
created: 2020-08-03T14:39:16
modified: 2021-01-30T23:02:02
alternative label: Apotropaion
broader: Figürliche Bauskulptur
definition: Meist als Fratze ausgebildet, aus Holz oder Stein an Giebel, Mauer oder Tür eines Hauses oder Tores als Abwehrzauber angebracht. [Koepf/Binding 2016]
definition: Neidkopf (von althochdeutsch nîd = Hass), Menschen- oder Tierkopf-Relief zur Abwehr böser Geister an Häusern, in romanischen Kirchen, an Taufsteinen und Chorgestühl. [Koch 2009]
definition: Reliéf lidské nebo zvířecí hlavy k odvrácení zlých duchů, na domech, v románských kostelích, na křtitelnicích a chórových lavicích. [Koch 2008] @cs
in scheme: Strukturtypen für Sakralbauten
in scheme: Quellennachweis Koch 2008
in scheme: Quellennachweis Koch 2009
in scheme: Strukturtypen
in scheme: Bamberger Vokabular für Historische Architektur
preferred label: máscara apotropaica @es
preferred label: maschera apotropaica @it
preferred label: ochranná hlava @cs
preferred label: apotropaic image @en
preferred label: tête conjuratoire @fr

Quellennachweis Koch 2008
type: NamedIndividual
type: ConceptScheme

Bamberger Vokabular für Historische Architektur
type: NamedIndividual
type: ConceptScheme

Quellennachweis Koch 2009
type: NamedIndividual
type: ConceptScheme

Strukturtypen
type: NamedIndividual
type: ConceptScheme

Strukturtypen für Sakralbauten
type: NamedIndividual
type: ConceptScheme