Abplatzung
type: Concept
type: NamedIndividual
created: 2019-05-08T18:39:15
modified: 2021-01-30T16:23:36
alternative label: Ausbruch
alternative label: break out @en
alternative label: vylomeni @cs
broader: Ablösung
definition: Perte locale de matière en surface de la pierre, dueà des pressions internes, se manifestant habituellementsous la forme d’un cratère à bords irréguliers. [ICOMOS-ISCS] @fr
definition: Lokaler Verlust der Steinoberfläche durch inneren Druck, im Allgemeinen in Form eines ungleichmäßig begrenzten Kraters. [ICOMOS-ISCS]
definition: Local loss of the stone surface from internal pressureusually manifesting in the form of an irregularlysidedcrater. [ICOMOS-ISCS] @en
definition: lokální ztráta povrchu kamene v důsledku vnitřního tlaku, obvykle se projevující ve formě nepravidelných jamek (kráterů). [ICOMOS-ISCS] @cs
in scheme: Begriffe für Naturstein- und Wandmalereirestaurierung
in scheme: Quellennachweis ICOMOS-ISCS
in scheme: Bamberger Vokabular für Historische Architektur
in scheme: Begriffe für Bauerhalt
preferred label: bursting @en
preferred label: eclatement @fr
preferred label: odštípnutý @cs
scope note: Bursting is sometimes preceded by star-shaped face-fractur ing. This deterioration pattern is due to the increase of vol ume of mineral inclusions (clays, iron minerals, etc.) naturally contained in the stone and situated near its surface. The corrosion of metallic reinforcing elements may also induce bur sting. [ICOMOS-ISCS] @en

Ablösung
type: NamedIndividual
type: Concept
narrower: Abplatzung
preferred label: oddělení @cs
preferred label: détatchment @fr
preferred label: detachment @en

Begriffe für Bauerhalt
type: NamedIndividual
type: ConceptScheme

Quellennachweis ICOMOS-ISCS
type: NamedIndividual
type: ConceptScheme

Bamberger Vokabular für Historische Architektur
type: NamedIndividual
type: ConceptScheme

Begriffe für Naturstein- und Wandmalereirestaurierung
type: NamedIndividual
type: ConceptScheme