Verkehrslast
type: NamedIndividual
type: Concept
created: 2019-10-01T09:56:51
modified: 2020-03-05T18:42:49
alternative label: charge roulante @fr
alternative label: Lebende Last
alternative label: Nutzlast
broader: Hauptlast
definition: Die veränderliche oder bewegliche Belastung des Bauteils (z.B. Personen, Einrichtungsstücke, Lagerstoffe, Riemenantriebe, Kranlasten, Wind und Schnee). [BVHA]
definition: Die aus Kräften und Gewichten resultierende Last, die nur vorübergehend wirksam ist, z.B. durch Witterungseinflüsse, verkehrsbedingte Erschütterungen oder Arbeiten am Gebäude. [Glossarium Artis]
in scheme: Bamberger Vokabular für Historische Architektur
in scheme: Quellennachweis Glossarium Artis
preferred label: charge variable @fr
preferred label: life load @en

Hauptlast
type: NamedIndividual
type: Concept
narrower: Verkehrslast

Quellennachweis Glossarium Artis
type: NamedIndividual
type: ConceptScheme

Bamberger Vokabular für Historische Architektur
type: NamedIndividual
type: ConceptScheme