Scamillus
type: NamedIndividual
type: Concept
created: 2020-08-11T17:14:21
modified: 2021-01-22T17:18:20
broader: Säulenelement
definition: An den Stylobat angearbeitetes, keilförmiges Ausgleichselement, das trotz des durch die Entwässerung bedingten Gefälles des Stylobats eine waagrechte Standfläche für die Säule schaffen soll. [Koepf / Binding 2016]
definition: 1. Einschnitt unterhalb des Säulenhalses; 2. keilförmiges Ausgleichselement zwischen dem leichten Gefälle des Stylobats und der waagerechten Standfläche der Säule. [Koch 2009]
definition: 1. Spára pod krčkem sloupu. 2. Klínovitý vyrovnávací prvek mezi mírným sklonem stylobatu a vodorovnou dosednou plochou sloupu. [Koch 2008] @cs
in scheme: Strukturtypen
in scheme: Quellennachweis Koch 2009
in scheme: Quellennachweis Koch 2008
in scheme: Bamberger Vokabular für Historische Architektur
preferred label: scamillus @en
preferred label: scamillo @it
preferred label: cuña en el estilóbato @es
preferred label: scamila @cs

Säulenelement
type: NamedIndividual
type: Concept
narrower: Scamillus
preferred label: část sloupu @cs

Quellennachweis Koch 2008
type: NamedIndividual
type: ConceptScheme

Bamberger Vokabular für Historische Architektur
type: NamedIndividual
type: ConceptScheme

Quellennachweis Koch 2009
type: NamedIndividual
type: ConceptScheme

Strukturtypen
type: NamedIndividual
type: ConceptScheme