Gerüstloch
type: NamedIndividual
type: Concept
created: 2019-07-15T09:40:25
modified: 2021-01-27T16:04:22
alternative label: lešenářské otvory @cs
alternative label: Rüstloch
broader: Versatzspur
definition: Die Stelle im Mauerwerk, in die ein Gerüstholz während der Bauarbeiten eingelegt wurde; anmittelalterlichen Bauten wurden Rüstlöcher manchmal auch nach Fertigstellung des Gebäudesnicht geschlossen. [Glossarium Artis, Bd. 3, Bögen und Mauerwerk]
definition: Im Mauerwerk ausgesparte viereckige Löcher für die Befestigung der Hölzer eines Baugerüsts. [Koch 2009]
definition: 1/2 Stein tiefe Aussparrung im Mauerwerk als Auflage für die Netzriegel des Gerüsts. [Koepf / Binding 2016]
definition: Holes purposely made in a wall to support a suspended scaffolding platform. [EwaGlos] @en
definition: Speziell angefertigte, eingetiefte Löcher in einer Wand zum Abstützen einer Gerüstplattform. [EwaGlos]
definition: Kruhové, nebo pravoúhlé otvory ve zdivu sloužící pro lešeňové trámy. [Koch 2008] @cs
in scheme: Quellennachweis Koch 2009
in scheme: Quellennachweis Glossarium Artis
in scheme: Bamberger Vokabular für Historische Architektur
in scheme: Strukturtypen
in scheme: Quellennachweis EwaGlos
in scheme: Quellennachweis Koepf / Binding 2016
in scheme: Strukturtypen für Burgen und Schlösser
in scheme: Quellennachweis Koch 2008
preferred label: trou de boulin @fr
preferred label: putlog hole @en

Versatzspur
type: NamedIndividual
type: Concept
narrower: Gerüstloch

Quellennachweis Glossarium Artis
type: NamedIndividual
type: ConceptScheme

Quellennachweis Koch 2008
type: NamedIndividual
type: ConceptScheme

Strukturtypen für Burgen und Schlösser
type: NamedIndividual
type: ConceptScheme

Bamberger Vokabular für Historische Architektur
type: NamedIndividual
type: ConceptScheme

Quellennachweis Koepf / Binding 2016
type: NamedIndividual
type: ConceptScheme

Quellennachweis Koch 2009
type: NamedIndividual
type: ConceptScheme

Strukturtypen
type: NamedIndividual
type: ConceptScheme

Quellennachweis EwaGlos
type: NamedIndividual
type: ConceptScheme