Sparren
type: NamedIndividual
type: Concept
narrower: Freisparren
preferred label: spar @en
preferred label: puntone @it
preferred label: krokev @cs
preferred label: chevron @fr
preferred label: cabio @es

Freisparren
type: NamedIndividual
type: Concept
created: 2019-11-21T10:32:37
modified: 2020-09-29T10:26:00
alternative label: chevron débordant @fr
alternative label: Freigespärre
alternative label: Flugsparren
broader: Sparren
definition: Giebelseitig frei vor die Giebelwand gesetztes Sparrenpaar; es wird am Fuß häufig durch einen auf dem vorkragenden Rähm liegenden, in sich unverrückbaren Dreiecksverband (in der Schweiz Flugsparrendreieck genannt, auch Sparrenknecht) gehalten und ruht im oberen Bereich auf vorkragenden Konstruktionshölzern (im Rheinland auch Schwebegiebel genannt). [Koepf / Binding 2016]
in scheme: Quellennachweis Glossarium Artis
in scheme: Bamberger Vokabular für Historische Architektur
in scheme: Strukturtypen
in scheme: Quellennachweis Eißing et al. 2012
preferred label: chevron en saillie @fr
scope note: Analog zum Freirofen bei giebelseitigen Dachüberstand vorstehender Sparren. [BVHA]

Quellennachweis Eißing et al. 2012
type: NamedIndividual
type: ConceptScheme

Quellennachweis Glossarium Artis
type: NamedIndividual
type: ConceptScheme

Bamberger Vokabular für Historische Architektur
type: NamedIndividual
type: ConceptScheme

Strukturtypen
type: NamedIndividual
type: ConceptScheme