Hippodamisches System
type: NamedIndividual
type: Concept
created: 2020-08-17T10:23:25
modified: 2021-01-15T16:05:16
broader: Stadtbaukunst
definition: Systém plánování měst nazvaný podle Hippodama z Milétu, nar. kolem r. 510 př. Kr. [Koch 2008] @cs
definition: Der nach dem gr. Städtebauer Hippodamos von Milet (5. Jh. v. Chr.) benannte, regelmäßige Stadtplan mit etwa gleich großen rechtwinkligen Baublöcken, die von regelmäßigen Parallelstraßen entgegen der alten regellosen Bauweise und im Unterschied zur röm. mit betonten Hauptachsen umgeben sind, vielleicht erstmalig bei dem nach 479 v. Chr. erfolgten Wiederaufbau von Milet angewandt und dann von großem Einfluss auf spätere Städtegründungen. [Koepf / Binding 2016]
definition: Nach Hippodamos von Milet, geb. um 510 v. Chr., benannte Stadtplanung. [Koch 2009]
in scheme: Quellennachweis Koch 2009
in scheme: Bamberger Vokabular für Historische Architektur
in scheme: Quellennachweis Koch 2008
in scheme: Quellennachweis Koepf / Binding 2016
in scheme: Begriffe für den Themenkomplex Sakralbau
preferred label: Hippodamův systém @cs

Stadtbaukunst
type: NamedIndividual
type: Concept
narrower: Hippodamisches System

Quellennachweis Koch 2008
type: NamedIndividual
type: ConceptScheme

Begriffe für den Themenkomplex Sakralbau
type: NamedIndividual
type: ConceptScheme

Bamberger Vokabular für Historische Architektur
type: NamedIndividual
type: ConceptScheme

Quellennachweis Koepf / Binding 2016
type: NamedIndividual
type: ConceptScheme

Quellennachweis Koch 2009
type: NamedIndividual
type: ConceptScheme