Kräfteverlauf
type: NamedIndividual
type: Concept
created: 2020-03-05T15:35:33
modified: 2021-01-21T16:46:40
broader: Lastfall
definition: Die Verteilung des beim Gewölbe auftretenden Druckes und Schubes. [Glossarium Artis]
in scheme: Bamberger Vokabular für Historische Architektur
preferred label: distribution of forces @en
preferred label: répartition des poussées @fr

Lastfall
type: NamedIndividual
type: Concept
narrower: Kräfteverlauf

Bamberger Vokabular für Historische Architektur
type: NamedIndividual
type: ConceptScheme