Konkretion
type: NamedIndividual
type: Concept
broader: Inkrustation (Schaden)
preferred label: konkrece @cs
preferred label: concrétion @fr
preferred label: concretion @en

Inkrustation (Schaden)
type: Concept
type: NamedIndividual
created: 2019-11-07T13:20:50
modified: 2021-01-30T16:45:09
alternative label: Inkrustation
broader: Natursteinschaden
broader: Schaden der Architekturoberfläche
definition: Compact, hard, mineral outer layer adhering to thestone. Surface morphology and colour are usuallydifferent from those of the stone. The term encrustation is used when the feature is clearly due to a precipitation process, following any kind of leaching. If there is no evidence of leaching and precipitation, the term crust will be employed. [ICOMOS-ISCS] @en
definition: Kompakte, harte, mineralische Schicht auf der Oberfläche, die fest am Stein haftet. Oberflächenmorphologie und Farbe unterscheiden sich normalerweise von der des Gesteins. [ICOMOS-ISCS]
definition: Kompaktní, tvrdá vnější minerální vrstva, lnoucí k povrchu kamene. povrchová morfologie a barva jsou obvykle odlišné od příslušného kamene. [ICOMOS-ISCS] @cs
definition: Les encroûtements adhèrent généralement fortement au substrat.L’élimination d’encroûtements peut s’accompagner d’undétachement de pierre. On emploie le terme encroûtement quand la figured’altération est clairement le résultat d’un processus de précipitation,à partir de solutions ayant percolé à travers unemaçonnerie. S’il n’y a pas de signes évidents qu’une percolationet une précipitation se sont produites, on préférera leterme croûte. [ICOMOS-ISCS] @fr
in scheme: Begriffe für Naturstein- und Wandmalereirestaurierung
in scheme: Bamberger Vokabular für Historische Architektur
in scheme: Begriffe für Bauerhalt
in scheme: Quellennachweis ICOMOS-ISCS
narrower: Konkretion
preferred label: incrustace @cs
preferred label: encrustation @en
preferred label: encroûtement @fr

Natursteinschaden
type: NamedIndividual
type: Concept
narrower: Inkrustation (Schaden)

Schaden der Architekturoberfläche
type: NamedIndividual
type: Concept
narrower: Inkrustation (Schaden)

Begriffe für Bauerhalt
type: NamedIndividual
type: ConceptScheme

Quellennachweis ICOMOS-ISCS
type: NamedIndividual
type: ConceptScheme

Bamberger Vokabular für Historische Architektur
type: NamedIndividual
type: ConceptScheme

Begriffe für Naturstein- und Wandmalereirestaurierung
type: NamedIndividual
type: ConceptScheme