Reinigungsprobe
type: NamedIndividual
type: Concept
broader: Reinigung

Reinigung
type: Concept
type: NamedIndividual
created: 2019-05-08T18:28:57
modified: 2021-03-19T14:44:01
broader: Restaurierung
definition: Action performed to remove dirt deposits, foreign matter and products of alteration present on the artwork surface that can be the source of decay or deterioration or aesthetic disturbance. (EwaGlos) @en
definition: Maßnahme, mit der Schmutzablagerungen, Fremdmaterial und Verwitterungsprodukte, die Schaden verursachen oder ästhetisch stören können, von einer Oberflache entfernt werden. (EwaGlos)
definition: Action visant a eliminer les depots de crasses, matieres etrangeres et produits d’alteration presents sur la surface d’un bien culturel, qui peuvent etre source d’alteration, degradation ou perturbation esthetique. (EwaGlos) @fr
in scheme: Bamberger Vokabular für Historische Architektur
in scheme: Begriffe für Bauerhalt
in scheme: Quellennachweis EwaGlos
narrower: Reinigungsprobe
preferred label: nettoyage @fr
preferred label: Почистване @bg
preferred label: oczyszczanie @pl
preferred label: temizleme @tr
preferred label: tisztítás @hu
preferred label: pulitura @it
preferred label: limpieza @es
preferred label: curățare @ro
preferred label: čišćenje @hr
preferred label: cleaning @en

Restaurierung
type: NamedIndividual
type: Concept
narrower: Reinigung

Begriffe für Bauerhalt
type: NamedIndividual
type: ConceptScheme

Bamberger Vokabular für Historische Architektur
type: NamedIndividual
type: ConceptScheme

Quellennachweis EwaGlos
type: NamedIndividual
type: ConceptScheme