Inkrustation (Kunsthandwerk)
type: NamedIndividual
type: Concept
created: 2020-08-04T11:19:39
modified: 2021-01-26T21:36:20
broader: Einlegearbeit
definition: Lat. crusta = kůra. Vkládání barevných kamenů do kamene, kdy se např. střídá světlejší a tmavší mramor (zvl. na stěnách a podlahách), rozkvět: antika, byzantské umění, Itálie od středověku po baroko. [Koch 2008] @cs
definition: Inkrustation (lat. crusta = Rinde), Einlegearbeit von farbigen Steinen in Stein, bei der z.B. heller und dunkler Marmor wechseln (besonders in Wänden und Fußböden). Blütezeit: Antike, Byzantinische Kunst, Italien vom Mittelalter bis Barock. [Koch 2009]
in scheme: Strukturtypen
in scheme: Bamberger Vokabular für Historische Architektur
in scheme: Quellennachweis Koch 2009
narrower: Cosmaten-Arbeit
preferred label: inkrustace (řemeslo) @cs

Cosmaten-Arbeit
type: NamedIndividual
type: Concept
broader: Inkrustation (Kunsthandwerk)
preferred label: kosmaté @cs

Einlegearbeit
type: NamedIndividual
type: Concept
narrower: Inkrustation (Kunsthandwerk)
preferred label: opus intestinum @la

Bamberger Vokabular für Historische Architektur
type: NamedIndividual
type: ConceptScheme

Quellennachweis Koch 2009
type: NamedIndividual
type: ConceptScheme

Strukturtypen
type: NamedIndividual
type: ConceptScheme