Fensterrahmen
type: NamedIndividual
type: Concept
narrower: Futter

Futter
type: NamedIndividual
type: Concept
created: 2019-05-23T08:42:54
modified: 2020-09-29T11:12:03
alternative label: Futterrahmen
broader: Fensterrahmen
definition: Die in einer Öffnung angebrachte innere Verkleidung, bes. als hölzerner Futterrahmen bei Türen und Fenstern. [Koepf / Binding 2016]
definition: Rahmen aus brettstarken Schenkeln, der die Fensteröffnung in einer Fachwerk- oder Blockwand i. d. R. von innen auskleidet. [Noky 1996]
definition: Futter- (Futterrahmen) Rahmen aus Holzbrettern, die in die Laibung gesetzt werden. Häufig in Zusammenhang mit einem Blendrahmen- oder Kastenfenster zu finden. [Pax - Fenster & Türen Fachbegriffe]
in scheme: Quellennachweis Koepf / Binding 2016
in scheme: Quellennachweis Noky 1996
in scheme: Quellennachweis Pax - Fenster & Türen Fachbegriffe
in scheme: Strukturtypen
in scheme: Bamberger Vokabular für Historische Architektur

Bamberger Vokabular für Historische Architektur
type: NamedIndividual
type: ConceptScheme

Quellennachweis Koepf / Binding 2016
type: NamedIndividual
type: ConceptScheme

Quellennachweis Noky 1996
type: NamedIndividual
type: ConceptScheme

Quellennachweis Pax - Fenster & Türen Fachbegriffe
type: NamedIndividual
type: ConceptScheme

Strukturtypen
type: NamedIndividual
type: ConceptScheme