Schwibbogen
type: Concept
type: NamedIndividual
created: 2019-02-18T20:29:21
modified: 2020-11-27T12:41:24
alternative label: arc-boutant @fr
alternative label: cavalcavia @it
alternative label: opěrný oblouk @cs
alternative label: fornice @it
alternative label: pier arch @en
alternative label: straining arch @en
alternative label: Schwebebogen
alternative label: vzpěrný oblouk @cs
alternative label: visutý oblouk @cs
broader: Bogen
definition: 1. Der gotische Strebebogen; 2. großer Stützbogen zwischen zwei Gebäuden oder Innenmauern. [Koch 2009]
definition: Der Verstrebung zweier Mauern dienender, frei gespannter Bogen, meist mit einer horizontalen Aufmauerung. Schwibbogen stützen auch die Außenwände gegenüberliegender Häuser in engen Gassen gegeneinander ab und tragen, wenn sie entsprechend breit angelegt sind, einen häufig gedeckten Gang, der die oberen Geschosse der Gebäude miteinander verbindet. [Glossarium Artis]
definition: Schwebebogen, waagrecht gespannter Bogen zur Übertragung des Horizontalschubs zwischen zwei Gebäuden, meist über engen Gassen. [Koepf / Binding 2016]
definition: Velký rozpěrný oblouk mezi dvěma budovami nebo vnitřními stěnami (Florencie). [Koch 2008] @cs
in scheme: Quellennachweis Koch 2009
in scheme: Quellennachweis Koch 2008
in scheme: Quellennachweis Glossarium Artis
in scheme: Strukturtypen
in scheme: Bamberger Vokabular für Historische Architektur
preferred label: prampouch @cs
preferred label: arc-diaphragme @fr
preferred label: arco de tensión @es
preferred label: diaphragm arch @en
preferred label: arco rampante @it
broader by function: Bogen

Bogen
type: NamedIndividual
type: Concept
narrower: Schwibbogen
preferred label: oblouk @cs
preferred label: arch @en
preferred label: arc @fr

Quellennachweis Glossarium Artis
type: NamedIndividual
type: ConceptScheme

Quellennachweis Koch 2008
type: NamedIndividual
type: ConceptScheme

Bamberger Vokabular für Historische Architektur
type: NamedIndividual
type: ConceptScheme

Quellennachweis Koch 2009
type: NamedIndividual
type: ConceptScheme

Strukturtypen
type: NamedIndividual
type: ConceptScheme