Hausmarke
type: Concept
type: NamedIndividual
created: 2020-08-05T12:57:16
modified: 2021-01-23T13:33:48
alternative label: Hofzeichen
alternative label: Hofmarke
alternative label: Hauszeichen
broader: Insignie
definition: Auch Hauszeichen, Hofmarke, -zeichen, meist erstgeburtsrechtlich erbliches Eigentumszeichen an Haus oder Hof, oft rechtsverbindlich anstelle der Unterschrift. Die jüngeren Söhne fügen dem Stammzeichen je einen neuen Strich zu. Oft ins Wappen aufgenommen. [Koch 2009]
definition: Hausmarke, Hauszeichen, figürl. oder geometr. Symbol zur Kennzeichnung eines Hauses, früher meist am Schlussstein der Eingangstür angebracht. Nach der H. wurden früher die Häuser benannt (Hausname, z.B. >zum Schwanen<), auch wenn es keine Gasthäuser waren. Die H. ersetzte die moderne Ordnungsnummer. [Koepf / Binding 2016]
in scheme: Begriffe für den Themenkomplex Sakralbau
in scheme: Bamberger Vokabular für Historische Architektur
in scheme: Quellennachweis Koepf / Binding 2016
in scheme: Quellennachweis Koch 2009

Insignie
type: NamedIndividual
type: Concept
narrower: Hausmarke
preferred label: insignia @la
preferred label: insigne @fr

Begriffe für den Themenkomplex Sakralbau
type: NamedIndividual
type: ConceptScheme

Bamberger Vokabular für Historische Architektur
type: NamedIndividual
type: ConceptScheme

Quellennachweis Koepf / Binding 2016
type: NamedIndividual
type: ConceptScheme

Quellennachweis Koch 2009
type: NamedIndividual
type: ConceptScheme