Eisenreiche Patina
type: NamedIndividual
type: Concept
created: 2019-11-07T14:30:21
modified: 2020-08-20T15:04:45
broader: Patina
definition: Natural black to brown thin layer enriched in iron/clay minerals, which can be found on iron containing sandstones. This kind of patina is generally observed in outdoors environment, and develops quite uniformly on the stone surface. [ICOMOS-ISCS] @en
definition: přírozená, tenká černá až hnědá vrstva obohacená železitými a jílovými minerály, která může být nalezena na pískovcích obsahujících železo. Tento druh patiny je obecně pozorován v přírodním prostředí a vyvíjí se dosti rovnoměrně na povrchu kamene. [ICOMOS-ISCS] @cs
definition: Natürliche, schwarze bis braune, dünne Schicht, angereichert an Eisen und Tonmineralen, die auf eisenhaltigen Sandsteinen vorgefunden werden kann. Diese Art von Patina wird allgemein im Freien angetroffen und entwickelt sich ziemlich gleichförmig auf der Steinoberfläche. [ICOMOS-ISCS]
definition: Type de patine brune à noire, se formant naturellement sur les grès contenant du fer. Elles se développent assez uniformément sur la surface de la pierre, dans les zones exposées aux intempéries. [ICOMOS-ISCS] @fr
in scheme: Bamberger Vokabular für Historische Architektur
in scheme: Quellennachweis ICOMOS-ISCS
preferred label: iron rich patina @en
preferred label: patine ferrugineuse @fr
preferred label: železem bohatá patina @cs

Patina
type: NamedIndividual
type: Concept
narrower: Eisenreiche Patina
preferred label: patine @fr
preferred label: patina @en

Quellennachweis ICOMOS-ISCS
type: NamedIndividual
type: ConceptScheme

Bamberger Vokabular für Historische Architektur
type: NamedIndividual
type: ConceptScheme