Karniesblei
type: NamedIndividual
type: Concept
created: 2019-05-23T08:58:10
modified: 2020-02-18T09:16:30
broader: Bleisprosse
definition: Als Fensterblei gilt auch Karniesblei, als Ersatz für Windeisen eine besonders feste Verbleiung, da die Bleistreifen um eine oder mehrere Metalldrähte geformt werden. Die Bezeichnung Karniesblei erklärt sich durch die Profilierung der Bleistreifen (Karnies: Bauw. Leiste oder Gesims mit S-förmigem Querschnitt). [Pax - Fenster & Türen Fachbegriffe]
definition: Bleistreifen, der aus zwei H -förmigen Teilen zusammengelötet wird, die zuvor gegossen und mit der Ziehmaschine gestreckt, geglättet und geformt wurden. Zwischen den beiden Rinnen, in die das Tafelglas gesteckt wird, verbleibt eine Röhre über die ganze Länge, durch die als Verstärkung in der Funktion eines Windeisens ein Eisendraht geschoben werden kann. Innen- und Außenseite haben Zierprofile, die den Namen "Karnies"-blei geben, eine Sonderform der Bleisprosse. [Noky 1996]
in scheme: Strukturtypen
in scheme: Quellennachweis Pax - Fenster & Türen Fachbegriffe
in scheme: Bamberger Vokabular für Historische Architektur
in scheme: Quellennachweis Noky 1996
broader by shape: Bleisprosse

Bleisprosse
type: NamedIndividual
type: Concept
narrower: Karniesblei

Bamberger Vokabular für Historische Architektur
type: NamedIndividual
type: ConceptScheme

Quellennachweis Noky 1996
type: NamedIndividual
type: ConceptScheme

Quellennachweis Pax - Fenster & Türen Fachbegriffe
type: NamedIndividual
type: ConceptScheme

Strukturtypen
type: NamedIndividual
type: ConceptScheme