Biologische Kolonisation
type: NamedIndividual
type: Concept
narrower: Moos
preferred label: colonisation biologique @fr
preferred label: biologická kolonizace @cs
preferred label: biological growth @en

Moos
type: Concept
type: NamedIndividual
created: 2019-11-13T11:37:41
modified: 2021-01-15T18:11:08
broader: Biologische Kolonisation
definition: en rostlina tvořící malé měkké zelené polštářky centimetrových rozměrů. Mechy vypadají zpravidla jako husté, pevně sbalené mikrolístečky (sub až milimetrových velikostí). Mechy často rostou na kamenech s otevřenými povrchovými dutinami, puklinami a v jakýchkoliv místech trvale nebo často vlhkých (spáry zdiva) a obvykle zastíněných. [ICOMOS-ISCS] @cs
definition: Vegetal organism forming small, soft and green cushions of centimetric size. Mosses look generally like dense micro-leaves (sub- to millimetric size) tightly packed together. Mosses often grow on stone surface open cavities, cracks, and in any place permanently or frequently wet (masonry joints), and usually shady. [ICOMOS-ISCS] @en
definition: Organisme végétal en forme de coussinets verts souples au toucher, de taille centimétrique. Les mousses ont l’apparence de petites feuilles (taille submillimétrique à millimétrique) assemblées en bouquets serrés. Les mousses se développent dans des cavités ouvertes, des fissures, des joints, toutes zones constamment ou souvent humides et/ou ombragées. [ICOMOS-ISCS] @fr
definition: Pflanzlicher Organismus, der kleine, weiche grüne Kissen von Zentimetergröße bildet. Moose sehen allgemein wie dichte Mikroblätter (Sub - bis Millimetergröße) aus, die dicht zusammen gepackt sind. Moose wachsen oft auf der Steinoberfläche in offenen Aushöhlungen, Rissen oder an anderen Stellen, die andauernd oder häufig feucht (Mauerwerksfugen) und gewöhnlich schattig sind. [ICOMOS-ISCS]
in scheme: Bamberger Vokabular für Historische Architektur
in scheme: Quellennachweis ICOMOS-ISCS
in scheme: Begriffe für den Themenkomplex Sakralbau
preferred label: moss @en
preferred label: mechy @cs
preferred label: mousse @fr

Quellennachweis ICOMOS-ISCS
type: NamedIndividual
type: ConceptScheme

Begriffe für den Themenkomplex Sakralbau
type: NamedIndividual
type: ConceptScheme

Bamberger Vokabular für Historische Architektur
type: NamedIndividual
type: ConceptScheme