Herrera-Stil
type: Concept
type: NamedIndividual
created: 2020-08-04T11:38:01
modified: 2021-01-15T18:26:17
alternative label: Desornamentado-Stil
alternative label: desornamentado @cs
broader: Renaissance
definition: Oficiální stavební sloh z doby vlády španělského krále Filipa II., nazvaný podle Juana de Herrery (1530-97), přísná verze italské renesance, vzhledem k úspornému dekoru nazýván také desornamentado, hlavní dílo: Escorial. [Koch 2008] @cs
definition: Nach Juan de Herrera, 1530-97, benannter offizieller Baustil zur Regierungszeit Philipps II., eine strenge Version der italienischen Renaissance, der wegen seines sparsamen Dekors auch »Desornamentado-Stil« genannt wird. Hauptwerk: Escorial. [Koch 2009]
in scheme: Bamberger Vokabular für Historische Architektur
in scheme: Quellennachweis Koch 2008
in scheme: Begriffe für den Themenkomplex Sakralbau
in scheme: Quellennachweis Koch 2009
preferred label: herrerův styl @cs

Renaissance
type: NamedIndividual
type: Concept
narrower: Herrera-Stil
preferred label: renesance @cs

Quellennachweis Koch 2008
type: NamedIndividual
type: ConceptScheme

Begriffe für den Themenkomplex Sakralbau
type: NamedIndividual
type: ConceptScheme

Bamberger Vokabular für Historische Architektur
type: NamedIndividual
type: ConceptScheme

Quellennachweis Koch 2009
type: NamedIndividual
type: ConceptScheme