Ziegel
type: NamedIndividual
type: Concept
narrower: Formstein
preferred label: cihla @cs

Formstein
type: Concept
type: NamedIndividual
created: 2020-08-03T14:56:39
modified: 2021-03-19T18:29:39
broader: Ziegel
definition: Formstein, natürl. oder künstl. Stein (Backstein, Ziegel, Beton), der in eine bes. Form gebracht ist, weil er als Bogenstein, für Gesimsprofile, Kämpfer, Schlussstein und in der modernen Architektur zur Fassadenverkleidung gebraucht wird. [Koepf / Binding 2016]
definition: Cihla, z níž sestavějí nepravidelné architektonické články (podhledy oblouků, kružba cihlové gotiky aj.), a proto je nutno ji pálit ve zvláštních formách. [Koch 2008] @cs
definition: Backstein, aus dem die unregelmäßigen Bauglieder (Bogenlaibungen, Maßwerk der Backsteingotik usw.) gebaut werden und der deshalb in besonderen Formen gebacken werden muss. [Koch 2009]
in scheme: Bamberger Vokabular für Historische Architektur
in scheme: Quellennachweis Koepf / Binding 2016
in scheme: Quellennachweis Koch 2008
in scheme: Strukturtypen
in scheme: Quellennachweis Koch 2009
preferred label: tvarovka @cs

Quellennachweis Koch 2008
type: NamedIndividual
type: ConceptScheme

Bamberger Vokabular für Historische Architektur
type: NamedIndividual
type: ConceptScheme

Quellennachweis Koepf / Binding 2016
type: NamedIndividual
type: ConceptScheme

Quellennachweis Koch 2009
type: NamedIndividual
type: ConceptScheme

Strukturtypen
type: NamedIndividual
type: ConceptScheme