Klosterraum
type: NamedIndividual
type: Concept
narrower: Refektorium

Refektorium
type: Concept
type: NamedIndividual
created: 2020-08-06T10:43:09
modified: 2021-01-25T16:24:57
alternative label: jídelna v klášteřích @cs
alternative label: Remter
alternative label: remter @cs
broader: Klosterraum
in scheme: Strukturtypen
in scheme: Bamberger Vokabular für Historische Architektur
in scheme: Strukturtypen für Sakralbauten
in scheme: Quellennachweis Koch 2008
in scheme: Quellennachweis Koch 2009
preferred label: réfectoire @fr
preferred label: redemtorium @la
preferred label: refektář @cs
preferred label: refectorio @es
preferred label: refectory @en
preferred label: refettorio @it
scope note: Speisesaal in einem Kloster. Das R. liegt in der Regel in dem der Kirche gegenüber liegenden Flügel des Kreuzgangs. Neben dem Kapitelsaal ist es bes. in Zisterzienserklöstern baukünstler. gestaltet; der längsrechteckige Raum ist häufig durch eine Säulenstellung und Kreuzgrat- bzw. Kreuzrippengewölbe zweischiffig geteilt und enthält ein Katheder mit Bet- und Lesepult, das auch in einer Mauernische erhöht angeordnet sein kann. Die Zisterzienser hatten im Westflügel der Klausur ein zweites R. für die Konversen. Im späten MA wurde neben dem R. auch ein beheizbares Winter-R. eingerichtet. Im Barock kann der Grundriss auch oval sein. Das R. in den orthodoxen Klöstern ist mit dem Katholikon (Kirche), einem genau bestimmten Bau- und Dekorationsprogramm, der zweitwichtigste Bau. Es liegt unmittelbar gegenüber dem Kirchenhauptportal, auch mit gemeinsamem Narthex. Seltener wird das R. als freistehender Sonderbau an die Klausur angefügt. Es ist ein flachgedeckter, selten gewölbter Saal, der im W in einer Apsis und zwei kleineren, seitl. Nischen für Weihrauch endet. Der Eingang befindet sich an der Ostseite. [Koepf/Binding 2016]
scope note: Speisesaal. Bei den Deutschordensrittern auch Remter genannt. [Koch 2009]
scope note: Remter, refektář v klášteře Řádu německých rytířů. [Koch 2008] @cs
scope note: Speisesaal (Refektorium) einer Ordensburg des Deutschordens. [Koepf/Binding 2016]

Quellennachweis Koch 2008
type: NamedIndividual
type: ConceptScheme

Bamberger Vokabular für Historische Architektur
type: NamedIndividual
type: ConceptScheme

Quellennachweis Koch 2009
type: NamedIndividual
type: ConceptScheme

Strukturtypen
type: NamedIndividual
type: ConceptScheme

Strukturtypen für Sakralbauten
type: NamedIndividual
type: ConceptScheme