Ablösung
type: NamedIndividual
type: Concept
narrower: Schalenbildung
preferred label: oddělení @cs
preferred label: détatchment @fr
preferred label: detachment @en

Schalenbildung
type: Concept
type: NamedIndividual
created: 2019-05-08T18:23:05
modified: 2021-01-30T16:30:32
alternative label: Abschalen
alternative label: cloque @fr
broader: Schaden der Architekturoberfläche
broader: Ablösung
definition: Das Ablösen der oberen Schichten vom Stein parallel zu dessen Oberfläche (wie Fischschuppen). Schalen sind größer als Schuppen. [EwaGlos]
definition: Détachement d’une couche superficielle de la pierresous forme d’un bombement creux plus ou moins fissuré,et de forme sub-hémisphérique. Ce détachementest indépendant de la structure interne de lapierre. [ICOMOS-ISCS] @fr
definition: The detachment of surface layers of stone parallel to the stone surface (like fish scales). These are larger than flakes (flaking). [EwaGlos] @en
definition: Separated, air-filled, raised hemispherical elevations on the face of stone resulting from the detachment of an outer stone layer. This detachment is not related to the stone structure. [ICOMOS-ISCS] @en
in scheme: Begriffe für Naturstein- und Wandmalereirestaurierung
in scheme: Begriffe für Bauerhalt
in scheme: Quellennachweis ICOMOS-ISCS
in scheme: Quellennachweis EwaGlos
in scheme: Bamberger Vokabular für Historische Architektur
narrower: Abschuppen
preferred label: boursourflure @fr
preferred label: blistering @en

Abschuppen
type: NamedIndividual
type: Concept
broader: Schalenbildung
preferred label: odlupování tenkých vrstev @cs
preferred label: scaling @en
preferred label: desquamation @fr

Schaden der Architekturoberfläche
type: NamedIndividual
type: Concept
narrower: Schalenbildung

Begriffe für Bauerhalt
type: NamedIndividual
type: ConceptScheme

Quellennachweis ICOMOS-ISCS
type: NamedIndividual
type: ConceptScheme

Bamberger Vokabular für Historische Architektur
type: NamedIndividual
type: ConceptScheme

Quellennachweis EwaGlos
type: NamedIndividual
type: ConceptScheme

Begriffe für Naturstein- und Wandmalereirestaurierung
type: NamedIndividual
type: ConceptScheme