Torus
type: NamedIndividual
type: Concept
preferred label: torus @cs
related: Attische Basis

Attische Basis
type: NamedIndividual
type: Concept
created: 2020-08-03T13:24:06
modified: 2021-01-22T16:37:50
broader: Basis
definition: Im 5. Jh. v. Chr. in Attika bzw. Athen entstandene Sonderform der ion. Basis, bestehend aus einer Hohlkehle (Trochilus) zwischen zwei Wülsten (Tori), von denen der obere etwas niedriger und weniger ausladend ist als der untere und manchmal mit einem Riemengeflecht verziert sein kann. Diese Form der Säulenbasis wurde später mit geringen Veränderungen (Eckzier) bes. von der roman. Baukunst häufig verwendet und auch noch vom Klassizismus bevorzugt. Differenziertere Sonderformen zeigt die Basis der kleinasiat. Ionischen Ordnung. [Koepf / Binding 2016]
definition: Patka aticko-iónského sloupu složená ze dvou oblounů (torus = obloun) a výžlabku mezi nimi (trochilus), na rozdíl od maloasijských typů bez plinty. [Koch 2008] @cs
definition: Säulenfuß der attisch-ionischen Säule aus 2 Wülsten (Torus = Wulst) und dazwischenliegender Hohlkehle (Trochilus), im Gegensatz zu den kleinasiatischen Formen ohne Plinthe. [Koch 2009]
in scheme: Quellennachweis Koepf / Binding 2016
in scheme: Quellennachweis Koch 2009
in scheme: Strukturtypen
in scheme: Quellennachweis Koch 2008
in scheme: Bamberger Vokabular für Historische Architektur
preferred label: atická patka @cs
related: Torus

Basis
type: NamedIndividual
type: Concept
narrower: Attische Basis
preferred label: patka @cs
preferred label: base @it

Quellennachweis Koch 2008
type: NamedIndividual
type: ConceptScheme

Bamberger Vokabular für Historische Architektur
type: NamedIndividual
type: ConceptScheme

Quellennachweis Koepf / Binding 2016
type: NamedIndividual
type: ConceptScheme

Quellennachweis Koch 2009
type: NamedIndividual
type: ConceptScheme

Strukturtypen
type: NamedIndividual
type: ConceptScheme