Plandarstellung
type: NamedIndividual
type: Concept
narrower: Grundriss

Grundriss
type: Concept
type: NamedIndividual
created: 2019-02-18T15:26:38
modified: 2020-09-30T09:15:48
alternative label: horizontaler Schnitt
broader: Plandarstellung
definition: Waagerechter Schnitt durch ein Bauwerk bzw. dessen Geschosse (Projektion) etwa in Brusthöhe. [Koepf / Binding 2016]
in scheme: Bamberger Vokabular für Historische Architektur
preferred label: půdorys @cs

Bamberger Vokabular für Historische Architektur
type: NamedIndividual
type: ConceptScheme