Bleichung
type: Concept
type: NamedIndividual
created: 2019-07-14T14:33:45
modified: 2021-01-30T17:40:28
alternative label: Entfärbung
alternative label: zesvětlení @cs
alternative label: Verblassen
alternative label: fading @en
alternative label: Ausbleichen
alternative label: Bleichen
alternative label: závoj @cs
broader: Verfärbung
definition: Bleichung ist eine Zunahme der Farbhelligkeit auf Grund der chemischen Verwitterung von Mineralen (z. B. Eisen- oder Mangan- Komponenten), der Extraktion von färbenden Bestandteilen („Auslaugung“, „Auswaschung“) oder des Verlusts der Politur. Dunk le und farbige Marmore zeigen oft eine Bleichung, wenn sie der Witterung ausgesetzt sind. [ICOMOS-ISCS]
definition: Gain in value due to chemical weatheringof minerals (e.g. reduction of iron and manganesecompounds) or extraction of coloring matter (leaching, washingout), or loss of polish, generally very superficial. Dark andbright color marbles often show bleaching as a result of exposureto weather. [ICOMOS-ISCS] @en
definition: Augmentation de clarté, due à l’altérationchimique des minéraux (par exemple réduction du fer et dumanganèse) ou à l’extraction de matière colorante (par lavage,lessivage), ou par perte de poli, généralement très superficielle.Les marbres foncés et ceux de couleurs vives subissentsouvent une décoloration suite à une exposition aux intempéries.Un blanchiment est une sorte de décoloration. [ICOMOS-ISCS] @fr
definition: Barva zbělá v důsledku chemickéhozvětrání minerálů (tj. redukcí oxidů železa a manganu), neboextrakcí barvící hmoty (vylouhováním, vyplavením, vymytím),nebo ztrátou lesku, zpravidla velice povrchově. Tmavé a jasnězbarvené mramory často blednou, jako důsledek vystavení povrchuvlivům povětrnosti. [ICOMOS-ISCS] @cs
in scheme: Begriffe für Bauerhalt
in scheme: Begriffe für Naturstein- und Wandmalereirestaurierung
in scheme: Quellennachweis EwaGlos
in scheme: Bamberger Vokabular für Historische Architektur
in scheme: Quellennachweis ICOMOS-ISCS
note: A chromatic change manifestedas a whitening of the constituent materials; tobecome white over time. [EwaGlos] @en
note: Eine Farbveränderung, die sich im Blasswerden bestehender Materialien äußert. [EwaGlos]
preferred label: zbělení @cs
preferred label: bleaching @en
preferred label: décoloration @fr

Verfärbung
type: NamedIndividual
type: Concept
narrower: Bleichung
preferred label: změna barvy @cs
preferred label: discolouration @en
preferred label: altération chromatique @fr

Begriffe für Bauerhalt
type: NamedIndividual
type: ConceptScheme

Quellennachweis ICOMOS-ISCS
type: NamedIndividual
type: ConceptScheme

Bamberger Vokabular für Historische Architektur
type: NamedIndividual
type: ConceptScheme

Quellennachweis EwaGlos
type: NamedIndividual
type: ConceptScheme

Begriffe für Naturstein- und Wandmalereirestaurierung
type: NamedIndividual
type: ConceptScheme