Gebäudeteil
type: NamedIndividual
type: Concept
narrower: Corps de logis
preferred label: část budovy @cs

Corps de logis
type: NamedIndividual
type: Concept
created: 2020-07-16T12:26:41
modified: 2021-01-27T14:27:56
broader: Gebäudeteil
definition: ( frz.), baulich hervorgehobener Hauptbau eines Schlosses. Diese Hervorhebung entstand im französischen Schlossbau der Renaissance (Azay-le-Rideau F, 1518–27) und bleibt auch für die Barockzeit bestimmend. Das C. d. l. nimmt im Allgemeinen die Repräsentationsräume und herrschaftlichen Appartements auf. Fast immer ist es gegenüber den anderen Gebäudeteilen des Schlosses formal betont, bei Dreiflügelanlagen (Flügel) handelt es sich um den mittigen Hauptflügel. B. Sch.-W./H. L. [Wörterbuch der Burgen, Schlösser und Festungen]
definition: Hauptbau mit der Herrschaftswohnung an der Stirnseite des Ehrenhofs eines Barockschlosses. [Koch 2009]
definition: Corps de logis (frz.), Bezeichnung für das mittlere Hauptgebäude, das >Wohnhaus< der Herrschaft für Wohn- und Repräsentationszwecke; seit dem Barock enthält es meist ein repräsentatives Treppenhaus und prunkvolle Festräume. [Koepf / Binding 2016]
definition: Hlavní objekt barokního zámku s obydlím panstva na čelní straně čestného dvora. [Koch 2008] @cs
in scheme: Strukturtypen für Sakralbauten
in scheme: Quellennachweis Koch 2008
in scheme: Strukturtypen
in scheme: Quellennachweis Koepf / Binding 2016
in scheme: Bamberger Vokabular für Historische Architektur
in scheme: Strukturtypen für Burgen und Schlösser
in scheme: Quellennachweis Koch 2009
preferred label: corps de logis @cs

Quellennachweis Koch 2008
type: NamedIndividual
type: ConceptScheme

Strukturtypen für Burgen und Schlösser
type: NamedIndividual
type: ConceptScheme

Bamberger Vokabular für Historische Architektur
type: NamedIndividual
type: ConceptScheme

Quellennachweis Koepf / Binding 2016
type: NamedIndividual
type: ConceptScheme

Quellennachweis Koch 2009
type: NamedIndividual
type: ConceptScheme

Strukturtypen
type: NamedIndividual
type: ConceptScheme

Strukturtypen für Sakralbauten
type: NamedIndividual
type: ConceptScheme