Zierbogen
type: NamedIndividual
type: Concept
narrower: Faszienbogen
preferred label: decorated arch @en
preferred label: arc orné @fr

Faszienbogen
type: Concept
type: NamedIndividual
created: 2019-10-21T12:03:07
modified: 2020-09-14T09:35:03
broader: Zierbogen
definition: Mit Faszien architravierter Bogen, je nach der Zahl der Faszien können die toskanische (mit einer), die dor. (mit zwei), die ion. und die korinth. Archivolte (mit drei) F. unterschieden werden. In der Antike, an antikisierenden Bauten der Romanik und in der Renaissance angewandt. [Koepf / Binding 2016]
definition: Bogen, dessen Stirn durch drei, seltener zwei übereinanderliegende, leicht vorkragende bandartige Streifen gegliedert ist. [Glossarium Artis]
in scheme: Quellennachweis Glossarium Artis
in scheme: Strukturtypen
in scheme: Bamberger Vokabular für Historische Architektur
in scheme: Quellennachweis Koepf / Binding 2016
preferred label: arc orné de fasces @fr
preferred label: arch decorated with fascias @en

Quellennachweis Glossarium Artis
type: NamedIndividual
type: ConceptScheme

Bamberger Vokabular für Historische Architektur
type: NamedIndividual
type: ConceptScheme

Quellennachweis Koepf / Binding 2016
type: NamedIndividual
type: ConceptScheme

Strukturtypen
type: NamedIndividual
type: ConceptScheme