Hebefenster
type: Concept
type: NamedIndividual
created: 2019-06-17T17:07:37
modified: 2020-09-30T11:01:21
broader: Fensterverschluss
definition: Sonderform des Schiebefensters, dessen bewegl. Flügel gegen einen meist feststehenden oberen Teil gehoben und festgestellt wird. [Koepf / Binding 2016]
definition: Fenstertyp, bei dem die gesamte untere Hälfte als Hebeflügel vor die obere geschoben werden kann. Die Form ist, von Holland kommend, vorwiegend in Norddeutschland zu finden. Sie tritt im 18. Jh. auf, aber aufgrund der aufwendigen Konstruktion nur in anspruchsvolleren Gebäuden. [Noky 1996]
in scheme: Quellennachweis Noky 1996
in scheme: Strukturtypen
in scheme: Bamberger Vokabular für Historische Architektur
in scheme: Quellennachweis Koepf / Binding 2016
broader by construction: Fensterverschluss

Fensterverschluss
type: NamedIndividual
type: Concept
narrower: Hebefenster

Bamberger Vokabular für Historische Architektur
type: NamedIndividual
type: ConceptScheme

Quellennachweis Koepf / Binding 2016
type: NamedIndividual
type: ConceptScheme

Quellennachweis Noky 1996
type: NamedIndividual
type: ConceptScheme

Strukturtypen
type: NamedIndividual
type: ConceptScheme